{"text_format":"1","workbook":"xlsx","n_sheets":10,"sheets":["GNST","ENTK","HAEMO","PSEUD","STREP","STAPH","MRSA","CAMP","Ark1","Ark2"],"not_rendered":{"charts":45,"images":0,"macros":1,"external_links":0,"defined_names":0,"comments":0,"pivot_tables":0},"unopened":[],"bounds":{"document_bytes":16777216,"sheet_cells":100000,"rows_first":2000,"rows_last":500,"rows_between":2000,"halvings":0,"cell_chars":16384,"cell_head_chars":4096},"cells_cut":0,"cells_raw":0,"read":"whole","date_system":"1900"}

{"sheet":"GNST","index":0,"n_rows":44,"n_cols":70,"rows_kept":44,"cut":false,"hidden":false,"merged":[[4,68,4,69],[4,0,4,1],[4,3,4,38],[4,50,4,51],[4,52,4,53],[4,54,4,55],[4,56,4,57],[4,58,4,59],[4,60,4,61],[4,62,4,63],[4,64,4,65],[4,66,4,67]]}
["Gram negative store staver (GNST)"]
["2019-10-01",null,null,"PA Jenum"]
["Registrér etter at måleverdiene er lagt inn"]
[]
["Ukentlig",null,null,"E.coli    ATCC 25922",null,null,null,null,null,null,null,null,null,null,null,null,null,null,null,null,null,null,null,null,null,null,null,null,null,null,null,null,null,null,null,null,null,null,null,null,null,null,null,null,null,null,null,null,null,null,{"$f":"E6","v":"AMP 10"},null,{"$f":"I6","v":"SXT 25"},null,{"$f":"M6","v":"CN 10"},null,{"$f":"Q6","v":"MEL 10"},null,{"$f":"U6","v":"TZP 36"},null,{"$f":"Y6","v":"CTX   5"},null,{"$f":"AC6","v":"CAZ   10"},null,{"$f":"AG6","v":"CIP       5"},null,{"$f":"AK6","v":"MEM 10"},null,"ETP10"]
["Dato","Nr",null,"Ampicillin 10","AMP 10","Sonegrenser","Target","Trim-sulfa","SXT 25","Sonegrenser","Target","Gentamicin 10","CN 10","Sonegrenser","Target","Mecillinam 10","MEL 10","Sonegrenser","Target","Piperacillin Tazobactam","TZP 36","Sonegrenser","Target","Cefotaxim 5 ","CTX   5","Sonegrenser","Target","Ceftazidime 10","CAZ   10","Sonegrenser","Target","Ciprofloxacin 5","CIP       5","Sonegrenser","Target","Meropenem 10","MEM 10","Sonegrenser","Target","Ertapenem 10","ETP 10","Sonegrenser","Target",null,null,null,null,null,null,null,"Øvre","Nedre","Øvre","Nedre","Øvre","Nedre","Øvre","Nedre","Øvre","Nedre","Øvre","Nedre","Øvre","Nedre","Øvre","Nedre","Øvre","Nedre","Øvre","Nedre"]
["Snitt","Siste 30",null,{"$f":"AVERAGE(D$15:D$44)","v":16.25},"+-2SD",{"$f":"IF(F8=\"\",\"\",IF(D7>(3+((F8+F9)/2)),\"NB\",IF(D7<(-3+((F8+F9)/2)),\"NB\",\"OK\")))","v":"OK"},18.5,{"$f":"AVERAGE(H$15:H$44)","v":26.5},null,{"$f":"IF(J8=\"\",\"\",IF(H7>(3+((J8+J9)/2)),\"NB\",IF(H7<(-3+((J8+J9)/2)),\"NB\",\"OK\")))","v":"OK"},26,{"$f":"AVERAGE(L$15:L$44)","v":19.5},"+-2SD",{"$f":"IF(N8=\"\",\"\",IF(L7>(3+((N8+N9)/2)),\"NB\",IF(L7<(-3+((N8+N9)/2)),\"NB\",\"OK\")))","v":"OK"},22.5,{"$f":"AVERAGE(P$15:P$44)","v":26.25},"+-2SD",{"$f":"IF(R8=\"\",\"\",IF(P7>(3+((R8+R9)/2)),\"NB\",IF(P7<(-3+((R8+R9)/2)),\"NB\",\"OK\")))","v":"OK"},27,{"$f":"AVERAGE(T$15:T$44)","v":23},"+-2SD",{"$f":"IF(V8=\"\",\"\",IF(T7>(3+((V8+V9)/2)),\"NB\",IF(T7<(-3+((V8+V9)/2)),\"NB\",\"OK\")))","v":"OK"},24,{"$f":"AVERAGE(X$15:X$44)","v":26},"+-2SD",{"$f":"IF(Z8=\"\",\"\",IF(X7>(3+((Z8+Z9)/2)),\"NB\",IF(X7<(-3+((Z8+Z9)/2)),\"NB\",\"OK\")))","v":"OK"},28,{"$f":"AVERAGE(AB$15:AB$44)","v":24.75},"+-2SD",{"$f":"IF(AD8=\"\",\"\",IF(AB7>(3+((AD8+AD9)/2)),\"NB\",IF(AB7<(-3+((AD8+AD9)/2)),\"NB\",\"OK\")))","v":"OK"},26,{"$f":"AVERAGE(AF$15:AF$44)","v":32},"+-2SD",{"$f":"IF(AH8=\"\",\"\",IF(AF7>(3+((AH8+AH9)/2)),\"NB\",IF(AF7<(-3+((AH8+AH9)/2)),\"NB\",\"OK\")))","v":"OK"},33,{"$f":"AVERAGE(AJ$15:AJ$44)","v":30.5},"+-2SD",{"$f":"IF(AL8=\"\",\"\",IF(AJ7>(3+((AL8+AL9)/2)),\"NB\",IF(AJ7<(-3+((AL8+AL9)/2)),\"NB\",\"OK\")))","v":"OK"},31.5,{"$f":"AVERAGE(AN$15:AN$44)","v":32.5},"+-2SD",{"$f":"IF(AP8=\"\",\"\",IF(AN7>(3+((AP8+AP9)/2)),\"NB\",IF(AN7<(-3+((AP8+AP9)/2)),\"NB\",\"OK\")))","v":"OK"},32.5]
["SD","Siste 30",null,{"$f":"STDEV(D$15:D$44)","v":0.9574271077563381},{"$f":"D7+(2*D8)","v":18.164854215512676},22,null,{"$f":"STDEV(H$15:H$44)","v":0.57735026918962573},{"$f":"H7+(2*H8)","v":27.654700538379252},29,null,{"$f":"STDEV(L$15:L$44)","v":0.57735026918962573},{"$f":"L7+(2*L8)","v":20.654700538379252},26,null,{"$f":"STDEV(P$15:P$44)","v":0.5},{"$f":"P7+(2*P8)","v":27.25},30,null,{"$f":"STDEV(T$15:T$44)","v":0},{"$f":"T7+(2*T8)","v":23},27,null,{"$f":"STDEV(X$15:X$44)","v":0},{"$f":"X7+(2*X8)","v":26},31,null,{"$f":"STDEV(AB$15:AB$44)","v":0.5},{"$f":"AB7+(2*AB8)","v":25.75},29,null,{"$f":"STDEV(AF$15:AF$44)","v":0.81649658092772603},{"$f":"AF7+(2*AF8)","v":33.632993161855453},37,null,{"$f":"STDEV(AJ$15:AJ$44)","v":1.2909944487358056},{"$f":"AJ7+(2*AJ8)","v":33.081988897471611},35,null,{"$f":"STDEV(AN$15:AN$44)","v":1},{"$f":"AN7+(2*AN8)","v":34.5},36]
["CV%",null,null,{"$f":"D8/D7","v":5.8918591246543882E-2},{"$f":"D7-(2*D8)","v":14.335145784487324},15,null,{"$f":"H8/H7","v":2.1786802610929273E-2},{"$f":"H7-(2*H8)","v":25.345299461620748},23,null,{"$f":"L8/L7","v":2.9607706112288499E-2},{"$f":"L7-(2*L8)","v":18.345299461620748},19,null,{"$f":"P8/P7","v":1.9047619047619049E-2},{"$f":"P7-(2*P8)","v":25.25},24,null,{"$f":"T8/T7","v":0},{"$f":"T7-(2*T8)","v":23},21,null,{"$f":"X8/X7","v":0},{"$f":"X7-(2*X8)","v":26},25,null,{"$f":"AB8/AB7","v":2.0202020202020204E-2},{"$f":"AB7-(2*AB8)","v":23.75},23,null,{"$f":"AF8/AF7","v":2.5515518153991439E-2},{"$f":"AF7-(2*AF8)","v":30.367006838144547},29,null,{"$f":"AJ8/AJ7","v":4.2327686843796904E-2},{"$f":"AJ7-(2*AJ8)","v":27.918011102528389},28,null,{"$f":"AN8/AN7","v":3.0769230769230771E-2},{"$f":"AN7-(2*AN8)","v":30.5},29]
[]
[]
["Legg inn diameter i hele millimeter i fargede felt i Rad 13"]
[]
[null,null,"Initialer, Avvik, Komm.",null,"Avvik","s30","RT",null,"Avvik","s30","RT",null,"Avvik","s30","RT",null,"Avvik","s30","RT",null,"Avvik","s30","RT",null,"Avvik","s30","RT",null,"Avvik","s30","RT",null,"Avvik","s30","RT",null,"Avvik","s30","RT",null,null,"s30","RT"]
["2019-09-25",1,null,15,{"$f":"(D15-$D$7)/$D$7","v":-7.6923076923076927E-2},{"$f":"IF((ABS(E15)>($D$9*3)),\"AV\",IF((ABS(E15)>($D$9*2)),\"NB\",\"\"))","v":""},null,27,{"$f":"(H15-$H$7)/$H$7","v":1.8867924528301886E-2},{"$f":"IF((ABS(I15)>($H$9*3)),\"AV\",IF((ABS(I15)>($H$9*2)),\"NB\",\"\"))","v":""},"",20,{"$f":"(L15-$L$7)/$L$7","v":2.564102564102564E-2},{"$f":"IF((ABS(M15)>($L$9*3)),\"AV\",IF((ABS(M15)>($L$9*2)),\"NB\",\"\"))","v":""},"",27,{"$f":"(P15-$P$7)/$P$7","v":2.8571428571428571E-2},{"$f":"IF((ABS(Q15)>($P$9*3)),\"AV\",IF((ABS(Q15)>($P$9*2)),\"NB\",\"\"))","v":""},"",23,{"$f":"(T15-$T$7)/$T$7","v":0},{"$f":"IF((ABS(U15)>($T$9*3)),\"AV\",IF((ABS(U15)>($T$9*2)),\"NB\",\"\"))","v":""},"",26,{"$f":"(X15-$X$7)/$X$7","v":0},{"$f":"IF((ABS(Y15)>($X$9*3)),\"AV\",IF((ABS(Y15)>($X$9*2)),\"NB\",\"\"))","v":""},"",25,{"$f":"(AB15-$AB$7)/$AB$7","v":1.0101010101010102E-2},{"$f":"IF((ABS(AC15)>($AB$9*3)),\"AV\",IF((ABS(AC15)>($AB$9*2)),\"NB\",\"\"))","v":""},"",31,{"$f":"(AF15-$AF$7)/$AF$7","v":-3.125E-2},{"$f":"IF((ABS(AG15)>($AF$9*3)),\"AV\",IF((ABS(AG15)>($AF$9*2)),\"NB\",\"\"))","v":""},"",31,{"$f":"(AJ15-$AJ$7)/$AJ$7","v":1.6393442622950821E-2},{"$f":"IF((ABS(AK15)>($AJ$9*3)),\"AV\",IF((ABS(AK15)>($AJ$9*2)),\"NB\",\"\"))","v":""},"",32,{"$f":"(AN15-$AN$7)/$AN$7","v":-1.5384615384615385E-2},{"$f":"IF((ABS(AO15)>($AN$9*3)),\"AV\",IF((ABS(AO15)>($AN$9*2)),\"NB\",\"\"))","v":""},"",null,null,null,null,null,null,null,{"$f":"F$8","v":22},{"$f":"F$9","v":15},{"$f":"J$8","v":29},{"$f":"J$9","v":23},{"$f":"N$8","v":26},{"$f":"N$9","v":19},{"$f":"R$8","v":30},{"$f":"R$9","v":24},{"$f":"V$8","v":27},{"$f":"V$9","v":21},{"$f":"Z$8","v":31},{"$f":"Z$9","v":25},{"$f":"AD$8","v":29},{"$f":"AD$9","v":23},{"$f":"AH$8","v":37},{"$f":"AH$9","v":29},{"$f":"AL$8","v":35},{"$f":"AL$9","v":28},36,29]
["2019-09-18",{"$f":"B15+1","v":2},null,16,{"$f":"(D16-$D$7)/$D$7","v":-1.5384615384615385E-2},{"$f":"IF((ABS(E16)>($D$9*3)),\"AV\",IF((ABS(E16)>($D$9*2)),\"NB\",\"\"))","v":""},"",26,{"$f":"(H16-$H$7)/$H$7","v":-1.8867924528301886E-2},{"$f":"IF((ABS(I16)>($H$9*3)),\"AV\",IF((ABS(I16)>($H$9*2)),\"NB\",\"\"))","v":""},null,19,{"$f":"(L16-$L$7)/$L$7","v":-2.564102564102564E-2},{"$f":"IF((ABS(M16)>($L$9*3)),\"AV\",IF((ABS(M16)>($L$9*2)),\"NB\",\"\"))","v":""},"",26,{"$f":"(P16-$P$7)/$P$7","v":-9.5238095238095247E-3},{"$f":"IF((ABS(Q16)>($P$9*3)),\"AV\",IF((ABS(Q16)>($P$9*2)),\"NB\",\"\"))","v":""},"",23,{"$f":"(T16-$T$7)/$T$7","v":0},{"$f":"IF((ABS(U16)>($T$9*3)),\"AV\",IF((ABS(U16)>($T$9*2)),\"NB\",\"\"))","v":""},"",26,{"$f":"(X16-$X$7)/$X$7","v":0},{"$f":"IF((ABS(Y16)>($X$9*3)),\"AV\",IF((ABS(Y16)>($X$9*2)),\"NB\",\"\"))","v":""},"",24,{"$f":"(AB16-$AB$7)/$AB$7","v":-3.0303030303030304E-2},{"$f":"IF((ABS(AC16)>($AB$9*3)),\"AV\",IF((ABS(AC16)>($AB$9*2)),\"NB\",\"\"))","v":""},"",32,{"$f":"(AF16-$AF$7)/$AF$7","v":0},{"$f":"IF((ABS(AG16)>($AF$9*3)),\"AV\",IF((ABS(AG16)>($AF$9*2)),\"NB\",\"\"))","v":""},"",29,{"$f":"(AJ16-$AJ$7)/$AJ$7","v":-4.9180327868852458E-2},{"$f":"IF((ABS(AK16)>($AJ$9*3)),\"AV\",IF((ABS(AK16)>($AJ$9*2)),\"NB\",\"\"))","v":""},null,32,{"$f":"(AN16-$AN$7)/$AN$7","v":-1.5384615384615385E-2},{"$f":"IF((ABS(AO16)>($AN$9*3)),\"AV\",IF((ABS(AO16)>($AN$9*2)),\"NB\",\"\"))","v":""},"",null,null,null,null,null,null,null,{"$f":"F$8","v":22},{"$f":"F$9","v":15},{"$f":"J$8","v":29},{"$f":"J$9","v":23},{"$f":"N$8","v":26},{"$f":"N$9","v":19},{"$f":"R$8","v":30},{"$f":"R$9","v":24},{"$f":"V$8","v":27},{"$f":"V$9","v":21},{"$f":"Z$8","v":31},{"$f":"Z$9","v":25},{"$f":"AD$8","v":29},{"$f":"AD$9","v":23},{"$f":"AH$8","v":37},{"$f":"AH$9","v":29},{"$f":"AL$8","v":35},{"$f":"AL$9","v":28},36,29]
["2019-09-11",3,null,17,{"$f":"(D17-$D$7)/$D$7","v":4.6153846153846156E-2},{"$f":"IF((ABS(E17)>($D$9*3)),\"AV\",IF((ABS(E17)>($D$9*2)),\"NB\",\"\"))","v":""},"",26,{"$f":"(H17-$H$7)/$H$7","v":-1.8867924528301886E-2},{"$f":"IF((ABS(I17)>($H$9*3)),\"AV\",IF((ABS(I17)>($H$9*2)),\"NB\",\"\"))","v":""},null,19,{"$f":"(L17-$L$7)/$L$7","v":-2.564102564102564E-2},{"$f":"IF((ABS(M17)>($L$9*3)),\"AV\",IF((ABS(M17)>($L$9*2)),\"NB\",\"\"))","v":""},"",26,{"$f":"(P17-$P$7)/$P$7","v":-9.5238095238095247E-3},{"$f":"IF((ABS(Q17)>($P$9*3)),\"AV\",IF((ABS(Q17)>($P$9*2)),\"NB\",\"\"))","v":""},"",23,{"$f":"(T17-$T$7)/$T$7","v":0},{"$f":"IF((ABS(U17)>($T$9*3)),\"AV\",IF((ABS(U17)>($T$9*2)),\"NB\",\"\"))","v":""},"",26,{"$f":"(X17-$X$7)/$X$7","v":0},{"$f":"IF((ABS(Y17)>($X$9*3)),\"AV\",IF((ABS(Y17)>($X$9*2)),\"NB\",\"\"))","v":""},"",25,{"$f":"(AB17-$AB$7)/$AB$7","v":1.0101010101010102E-2},{"$f":"IF((ABS(AC17)>($AB$9*3)),\"AV\",IF((ABS(AC17)>($AB$9*2)),\"NB\",\"\"))","v":""},"",32,{"$f":"(AF17-$AF$7)/$AF$7","v":0},{"$f":"IF((ABS(AG17)>($AF$9*3)),\"AV\",IF((ABS(AG17)>($AF$9*2)),\"NB\",\"\"))","v":""},"",30,{"$f":"(AJ17-$AJ$7)/$AJ$7","v":-1.6393442622950821E-2},{"$f":"IF((ABS(AK17)>($AJ$9*3)),\"AV\",IF((ABS(AK17)>($AJ$9*2)),\"NB\",\"\"))","v":""},"",32,{"$f":"(AN17-$AN$7)/$AN$7","v":-1.5384615384615385E-2},{"$f":"IF((ABS(AO17)>($AN$9*3)),\"AV\",IF((ABS(AO17)>($AN$9*2)),\"NB\",\"\"))","v":""},"",null,null,null,null,null,null,null,{"$f":"F$8","v":22},{"$f":"F$9","v":15},{"$f":"J$8","v":29},{"$f":"J$9","v":23},{"$f":"N$8","v":26},{"$f":"N$9","v":19},{"$f":"R$8","v":30},{"$f":"R$9","v":24},{"$f":"V$8","v":27},{"$f":"V$9","v":21},{"$f":"Z$8","v":31},{"$f":"Z$9","v":25},{"$f":"AD$8","v":29},{"$f":"AD$9","v":23},{"$f":"AH$8","v":37},{"$f":"AH$9","v":29},{"$f":"AL$8","v":35},{"$f":"AL$9","v":28},36,29]
["2019-09-04",4,null,17,{"$f":"(D18-$D$7)/$D$7","v":4.6153846153846156E-2},{"$f":"IF((ABS(E18)>($D$9*3)),\"AV\",IF((ABS(E18)>($D$9*2)),\"NB\",\"\"))","v":""},"",27,{"$f":"(H18-$H$7)/$H$7","v":1.8867924528301886E-2},{"$f":"IF((ABS(I18)>($H$9*3)),\"AV\",IF((ABS(I18)>($H$9*2)),\"NB\",\"\"))","v":""},"",20,{"$f":"(L18-$L$7)/$L$7","v":2.564102564102564E-2},{"$f":"IF((ABS(M18)>($L$9*3)),\"AV\",IF((ABS(M18)>($L$9*2)),\"NB\",\"\"))","v":""},"",26,{"$f":"(P18-$P$7)/$P$7","v":-9.5238095238095247E-3},{"$f":"IF((ABS(Q18)>($P$9*3)),\"AV\",IF((ABS(Q18)>($P$9*2)),\"NB\",\"\"))","v":""},"",23,{"$f":"(T18-$T$7)/$T$7","v":0},{"$f":"IF((ABS(U18)>($T$9*3)),\"AV\",IF((ABS(U18)>($T$9*2)),\"NB\",\"\"))","v":""},"",26,{"$f":"(X18-$X$7)/$X$7","v":0},{"$f":"IF((ABS(Y18)>($X$9*3)),\"AV\",IF((ABS(Y18)>($X$9*2)),\"NB\",\"\"))","v":""},"",25,{"$f":"(AB18-$AB$7)/$AB$7","v":1.0101010101010102E-2},{"$f":"IF((ABS(AC18)>($AB$9*3)),\"AV\",IF((ABS(AC18)>($AB$9*2)),\"NB\",\"\"))","v":""},"",33,{"$f":"(AF18-$AF$7)/$AF$7","v":3.125E-2},{"$f":"IF((ABS(AG18)>($AF$9*3)),\"AV\",IF((ABS(AG18)>($AF$9*2)),\"NB\",\"\"))","v":""},null,32,{"$f":"(AJ18-$AJ$7)/$AJ$7","v":4.9180327868852458E-2},{"$f":"IF((ABS(AK18)>($AJ$9*3)),\"AV\",IF((ABS(AK18)>($AJ$9*2)),\"NB\",\"\"))","v":""},"",34,{"$f":"(AN18-$AN$7)/$AN$7","v":4.6153846153846156E-2},{"$f":"IF((ABS(AO18)>($AN$9*3)),\"AV\",IF((ABS(AO18)>($AN$9*2)),\"NB\",\"\"))","v":""},"",null,null,null,null,null,null,null,{"$f":"F$8","v":22},{"$f":"F$9","v":15},{"$f":"J$8","v":29},{"$f":"J$9","v":23},{"$f":"N$8","v":26},{"$f":"N$9","v":19},{"$f":"R$8","v":30},{"$f":"R$9","v":24},{"$f":"V$8","v":27},{"$f":"V$9","v":21},{"$f":"Z$8","v":31},{"$f":"Z$9","v":25},{"$f":"AD$8","v":29},{"$f":"AD$9","v":23},{"$f":"AH$8","v":37},{"$f":"AH$9","v":29},{"$f":"AL$8","v":35},{"$f":"AL$9","v":28},36,29]
[null,null,null,null,null,null,null,null,null,null,null,null,null,null,null,null,null,null,null,null,null,null,null,null,null,null,null,null,null,null,null,null,null,null,null,null,null,null,null,null,null,null,null,null,null,null,null,null,null,null,{"$f":"F$8","v":22},{"$f":"F$9","v":15},{"$f":"J$8","v":29},{"$f":"J$9","v":23},{"$f":"N$8","v":26},{"$f":"N$9","v":19},{"$f":"R$8","v":30},{"$f":"R$9","v":24},{"$f":"V$8","v":27},{"$f":"V$9","v":21},{"$f":"Z$8","v":31},{"$f":"Z$9","v":25},{"$f":"AD$8","v":29},{"$f":"AD$9","v":23},{"$f":"AH$8","v":37},{"$f":"AH$9","v":29},{"$f":"AL$8","v":35},{"$f":"AL$9","v":28},36,29]
[null,null,null,null,null,null,null,null,null,null,null,null,null,null,null,null,null,null,null,null,null,null,null,null,null,null,null,null,null,null,null,null,null,null,null,null,null,null,null,null,null,null,null,null,null,null,null,null,null,null,{"$f":"F$8","v":22},{"$f":"F$9","v":15},{"$f":"J$8","v":29},{"$f":"J$9","v":23},{"$f":"N$8","v":26},{"$f":"N$9","v":19},{"$f":"R$8","v":30},{"$f":"R$9","v":24},{"$f":"V$8","v":27},{"$f":"V$9","v":21},{"$f":"Z$8","v":31},{"$f":"Z$9","v":25},{"$f":"AD$8","v":29},{"$f":"AD$9","v":23},{"$f":"AH$8","v":37},{"$f":"AH$9","v":29},{"$f":"AL$8","v":35},{"$f":"AL$9","v":28},36,29]
[null,null,null,null,null,null,null,null,null,null,null,null,null,null,null,null,null,null,null,null,null,null,null,null,null,null,null,null,null,null,null,null,null,null,null,null,null,null,null,null,null,null,null,null,null,null,null,null,null,null,{"$f":"F$8","v":22},{"$f":"F$9","v":15},{"$f":"J$8","v":29},{"$f":"J$9","v":23},{"$f":"N$8","v":26},{"$f":"N$9","v":19},{"$f":"R$8","v":30},{"$f":"R$9","v":24},{"$f":"V$8","v":27},{"$f":"V$9","v":21},{"$f":"Z$8","v":31},{"$f":"Z$9","v":25},{"$f":"AD$8","v":29},{"$f":"AD$9","v":23},{"$f":"AH$8","v":37},{"$f":"AH$9","v":29},{"$f":"AL$8","v":35},{"$f":"AL$9","v":28},36,29]
[null,null,null,null,null,null,null,null,null,null,null,null,null,null,null,null,null,null,null,null,null,null,null,null,null,null,null,null,null,null,null,null,null,null,null,null,null,null,null,null,null,null,null,null,null,null,null,null,null,null,{"$f":"F$8","v":22},{"$f":"F$9","v":15},{"$f":"J$8","v":29},{"$f":"J$9","v":23},{"$f":"N$8","v":26},{"$f":"N$9","v":19},{"$f":"R$8","v":30},{"$f":"R$9","v":24},{"$f":"V$8","v":27},{"$f":"V$9","v":21},{"$f":"Z$8","v":31},{"$f":"Z$9","v":25},{"$f":"AD$8","v":29},{"$f":"AD$9","v":23},{"$f":"AH$8","v":37},{"$f":"AH$9","v":29},{"$f":"AL$8","v":35},{"$f":"AL$9","v":28},36,29]
[null,null,null,null,null,null,null,null,null,null,null,null,null,null,null,null,null,null,null,null,null,null,null,null,null,null,null,null,null,null,null,null,null,null,null,null,null,null,null,null,null,null,null,null,null,null,null,null,null,null,{"$f":"F$8","v":22},{"$f":"F$9","v":15},{"$f":"J$8","v":29},{"$f":"J$9","v":23},{"$f":"N$8","v":26},{"$f":"N$9","v":19},{"$f":"R$8","v":30},{"$f":"R$9","v":24},{"$f":"V$8","v":27},{"$f":"V$9","v":21},{"$f":"Z$8","v":31},{"$f":"Z$9","v":25},{"$f":"AD$8","v":29},{"$f":"AD$9","v":23},{"$f":"AH$8","v":37},{"$f":"AH$9","v":29},{"$f":"AL$8","v":35},{"$f":"AL$9","v":28},36,29]
[null,null,null,null,null,null,null,null,null,null,null,null,null,null,null,null,null,null,null,null,null,null,null,null,null,null,null,null,null,null,null,null,null,null,null,null,null,null,null,null,null,null,null,null,null,null,null,null,null,null,{"$f":"F$8","v":22},{"$f":"F$9","v":15},{"$f":"J$8","v":29},{"$f":"J$9","v":23},{"$f":"N$8","v":26},{"$f":"N$9","v":19},{"$f":"R$8","v":30},{"$f":"R$9","v":24},{"$f":"V$8","v":27},{"$f":"V$9","v":21},{"$f":"Z$8","v":31},{"$f":"Z$9","v":25},{"$f":"AD$8","v":29},{"$f":"AD$9","v":23},{"$f":"AH$8","v":37},{"$f":"AH$9","v":29},{"$f":"AL$8","v":35},{"$f":"AL$9","v":28},36,29]
[null,null,null,null,null,null,null,null,null,null,null,null,null,null,null,null,null,null,null,null,null,null,null,null,null,null,null,null,null,null,null,null,null,null,null,null,null,null,null,null,null,null,null,null,null,null,null,null,null,null,{"$f":"F$8","v":22},{"$f":"F$9","v":15},{"$f":"J$8","v":29},{"$f":"J$9","v":23},{"$f":"N$8","v":26},{"$f":"N$9","v":19},{"$f":"R$8","v":30},{"$f":"R$9","v":24},{"$f":"V$8","v":27},{"$f":"V$9","v":21},{"$f":"Z$8","v":31},{"$f":"Z$9","v":25},{"$f":"AD$8","v":29},{"$f":"AD$9","v":23},{"$f":"AH$8","v":37},{"$f":"AH$9","v":29},{"$f":"AL$8","v":35},{"$f":"AL$9","v":28},36,29]
[null,null,null,null,null,null,null,null,null,null,null,null,null,null,null,null,null,null,null,null,null,null,null,null,null,null,null,null,null,null,null,null,null,null,null,null,null,null,null,null,null,null,null,null,null,null,null,null,null,null,{"$f":"F$8","v":22},{"$f":"F$9","v":15},{"$f":"J$8","v":29},{"$f":"J$9","v":23},{"$f":"N$8","v":26},{"$f":"N$9","v":19},{"$f":"R$8","v":30},{"$f":"R$9","v":24},{"$f":"V$8","v":27},{"$f":"V$9","v":21},{"$f":"Z$8","v":31},{"$f":"Z$9","v":25},{"$f":"AD$8","v":29},{"$f":"AD$9","v":23},{"$f":"AH$8","v":37},{"$f":"AH$9","v":29},{"$f":"AL$8","v":35},{"$f":"AL$9","v":28},36,29]
[null,null,null,null,null,null,null,null,null,null,null,null,null,null,null,null,null,null,null,null,null,null,null,null,null,null,null,null,null,null,null,null,null,null,null,null,null,null,null,null,null,null,null,null,null,null,null,null,null,null,{"$f":"F$8","v":22},{"$f":"F$9","v":15},{"$f":"J$8","v":29},{"$f":"J$9","v":23},{"$f":"N$8","v":26},{"$f":"N$9","v":19},{"$f":"R$8","v":30},{"$f":"R$9","v":24},{"$f":"V$8","v":27},{"$f":"V$9","v":21},{"$f":"Z$8","v":31},{"$f":"Z$9","v":25},{"$f":"AD$8","v":29},{"$f":"AD$9","v":23},{"$f":"AH$8","v":37},{"$f":"AH$9","v":29},{"$f":"AL$8","v":35},{"$f":"AL$9","v":28},36,29]
[null,null,null,null,null,null,null,null,null,null,null,null,null,null,null,null,null,null,null,null,null,null,null,null,null,null,null,null,null,null,null,null,null,null,null,null,null,null,null,null,null,null,null,null,null,null,null,null,null,null,{"$f":"F$8","v":22},{"$f":"F$9","v":15},{"$f":"J$8","v":29},{"$f":"J$9","v":23},{"$f":"N$8","v":26},{"$f":"N$9","v":19},{"$f":"R$8","v":30},{"$f":"R$9","v":24},{"$f":"V$8","v":27},{"$f":"V$9","v":21},{"$f":"Z$8","v":31},{"$f":"Z$9","v":25},{"$f":"AD$8","v":29},{"$f":"AD$9","v":23},{"$f":"AH$8","v":37},{"$f":"AH$9","v":29},{"$f":"AL$8","v":35},{"$f":"AL$9","v":28},36,29]
[null,null,null,null,null,null,null,null,null,null,null,null,null,null,null,null,null,null,null,null,null,null,null,null,null,null,null,null,null,null,null,null,null,null,null,null,null,null,null,null,null,null,null,null,null,null,null,null,null,null,{"$f":"F$8","v":22},{"$f":"F$9","v":15},{"$f":"J$8","v":29},{"$f":"J$9","v":23},{"$f":"N$8","v":26},{"$f":"N$9","v":19},{"$f":"R$8","v":30},{"$f":"R$9","v":24},{"$f":"V$8","v":27},{"$f":"V$9","v":21},{"$f":"Z$8","v":31},{"$f":"Z$9","v":25},{"$f":"AD$8","v":29},{"$f":"AD$9","v":23},{"$f":"AH$8","v":37},{"$f":"AH$9","v":29},{"$f":"AL$8","v":35},{"$f":"AL$9","v":28},36,29]
[null,null,null,null,null,null,null,null,null,null,null,null,null,null,null,null,null,null,null,null,null,null,null,null,null,null,null,null,null,null,null,null,null,null,null,null,null,null,null,null,null,null,null,null,null,null,null,null,null,null,{"$f":"F$8","v":22},{"$f":"F$9","v":15},{"$f":"J$8","v":29},{"$f":"J$9","v":23},{"$f":"N$8","v":26},{"$f":"N$9","v":19},{"$f":"R$8","v":30},{"$f":"R$9","v":24},{"$f":"V$8","v":27},{"$f":"V$9","v":21},{"$f":"Z$8","v":31},{"$f":"Z$9","v":25},{"$f":"AD$8","v":29},{"$f":"AD$9","v":23},{"$f":"AH$8","v":37},{"$f":"AH$9","v":29},{"$f":"AL$8","v":35},{"$f":"AL$9","v":28},36,29]
[null,null,null,null,null,null,null,null,null,null,null,null,null,null,null,null,null,null,null,null,null,null,null,null,null,null,null,null,null,null,null,null,null,null,null,null,null,null,null,null,null,null,null,null,null,null,null,null,null,null,{"$f":"F$8","v":22},{"$f":"F$9","v":15},{"$f":"J$8","v":29},{"$f":"J$9","v":23},{"$f":"N$8","v":26},{"$f":"N$9","v":19},{"$f":"R$8","v":30},{"$f":"R$9","v":24},{"$f":"V$8","v":27},{"$f":"V$9","v":21},{"$f":"Z$8","v":31},{"$f":"Z$9","v":25},{"$f":"AD$8","v":29},{"$f":"AD$9","v":23},{"$f":"AH$8","v":37},{"$f":"AH$9","v":29},{"$f":"AL$8","v":35},{"$f":"AL$9","v":28},36,29]
[null,null,null,null,null,null,null,null,null,null,null,null,null,null,null,null,null,null,null,null,null,null,null,null,null,null,null,null,null,null,null,null,null,null,null,null,null,null,null,null,null,null,null,null,null,null,null,null,null,null,{"$f":"F$8","v":22},{"$f":"F$9","v":15},{"$f":"J$8","v":29},{"$f":"J$9","v":23},{"$f":"N$8","v":26},{"$f":"N$9","v":19},{"$f":"R$8","v":30},{"$f":"R$9","v":24},{"$f":"V$8","v":27},{"$f":"V$9","v":21},{"$f":"Z$8","v":31},{"$f":"Z$9","v":25},{"$f":"AD$8","v":29},{"$f":"AD$9","v":23},{"$f":"AH$8","v":37},{"$f":"AH$9","v":29},{"$f":"AL$8","v":35},{"$f":"AL$9","v":28},36,29]
[null,null,null,null,null,null,null,null,null,null,null,null,null,null,null,null,null,null,null,null,null,null,null,null,null,null,null,null,null,null,null,null,null,null,null,null,null,null,null,null,null,null,null,null,null,null,null,null,null,null,{"$f":"F$8","v":22},{"$f":"F$9","v":15},{"$f":"J$8","v":29},{"$f":"J$9","v":23},{"$f":"N$8","v":26},{"$f":"N$9","v":19},{"$f":"R$8","v":30},{"$f":"R$9","v":24},{"$f":"V$8","v":27},{"$f":"V$9","v":21},{"$f":"Z$8","v":31},{"$f":"Z$9","v":25},{"$f":"AD$8","v":29},{"$f":"AD$9","v":23},{"$f":"AH$8","v":37},{"$f":"AH$9","v":29},{"$f":"AL$8","v":35},{"$f":"AL$9","v":28},36,29]
[null,null,null,null,null,null,null,null,null,null,null,null,null,null,null,null,null,null,null,null,null,null,null,null,null,null,null,null,null,null,null,null,null,null,null,null,null,null,null,null,null,null,null,null,null,null,null,null,null,null,{"$f":"F$8","v":22},{"$f":"F$9","v":15},{"$f":"J$8","v":29},{"$f":"J$9","v":23},{"$f":"N$8","v":26},{"$f":"N$9","v":19},{"$f":"R$8","v":30},{"$f":"R$9","v":24},{"$f":"V$8","v":27},{"$f":"V$9","v":21},{"$f":"Z$8","v":31},{"$f":"Z$9","v":25},{"$f":"AD$8","v":29},{"$f":"AD$9","v":23},{"$f":"AH$8","v":37},{"$f":"AH$9","v":29},{"$f":"AL$8","v":35},{"$f":"AL$9","v":28},36,29]
[null,null,null,null,null,null,null,null,null,null,null,null,null,null,null,null,null,null,null,null,null,null,null,null,null,null,null,null,null,null,null,null,null,null,null,null,null,null,null,null,null,null,null,null,null,null,null,null,null,null,{"$f":"F$8","v":22},{"$f":"F$9","v":15},{"$f":"J$8","v":29},{"$f":"J$9","v":23},{"$f":"N$8","v":26},{"$f":"N$9","v":19},{"$f":"R$8","v":30},{"$f":"R$9","v":24},{"$f":"V$8","v":27},{"$f":"V$9","v":21},{"$f":"Z$8","v":31},{"$f":"Z$9","v":25},{"$f":"AD$8","v":29},{"$f":"AD$9","v":23},{"$f":"AH$8","v":37},{"$f":"AH$9","v":29},{"$f":"AL$8","v":35},{"$f":"AL$9","v":28},36,29]
[null,null,null,null,null,null,null,null,null,null,null,null,null,null,null,null,null,null,null,null,null,null,null,null,null,null,null,null,null,null,null,null,null,null,null,null,null,null,null,null,null,null,null,null,null,null,null,null,null,null,{"$f":"F$8","v":22},{"$f":"F$9","v":15},{"$f":"J$8","v":29},{"$f":"J$9","v":23},{"$f":"N$8","v":26},{"$f":"N$9","v":19},{"$f":"R$8","v":30},{"$f":"R$9","v":24},{"$f":"V$8","v":27},{"$f":"V$9","v":21},{"$f":"Z$8","v":31},{"$f":"Z$9","v":25},{"$f":"AD$8","v":29},{"$f":"AD$9","v":23},{"$f":"AH$8","v":37},{"$f":"AH$9","v":29},{"$f":"AL$8","v":35},{"$f":"AL$9","v":28},36,29]
[null,null,null,null,null,null,null,null,null,null,null,null,null,null,null,null,null,null,null,null,null,null,null,null,null,null,null,null,null,null,null,null,null,null,null,null,null,null,null,null,null,null,null,null,null,null,null,null,null,null,{"$f":"F$8","v":22},{"$f":"F$9","v":15},{"$f":"J$8","v":29},{"$f":"J$9","v":23},{"$f":"N$8","v":26},{"$f":"N$9","v":19},{"$f":"R$8","v":30},{"$f":"R$9","v":24},{"$f":"V$8","v":27},{"$f":"V$9","v":21},{"$f":"Z$8","v":31},{"$f":"Z$9","v":25},{"$f":"AD$8","v":29},{"$f":"AD$9","v":23},{"$f":"AH$8","v":37},{"$f":"AH$9","v":29},{"$f":"AL$8","v":35},{"$f":"AL$9","v":28},36,29]
[null,null,null,null,null,null,null,null,null,null,null,null,null,null,null,null,null,null,null,null,null,null,null,null,null,null,null,null,null,null,null,null,null,null,null,null,null,null,null,null,null,null,null,null,null,null,null,null,null,null,{"$f":"F$8","v":22},{"$f":"F$9","v":15},{"$f":"J$8","v":29},{"$f":"J$9","v":23},{"$f":"N$8","v":26},{"$f":"N$9","v":19},{"$f":"R$8","v":30},{"$f":"R$9","v":24},{"$f":"V$8","v":27},{"$f":"V$9","v":21},{"$f":"Z$8","v":31},{"$f":"Z$9","v":25},{"$f":"AD$8","v":29},{"$f":"AD$9","v":23},{"$f":"AH$8","v":37},{"$f":"AH$9","v":29},{"$f":"AL$8","v":35},{"$f":"AL$9","v":28},36,29]
[null,null,null,null,null,null,null,null,null,null,null,null,null,null,null,null,null,null,null,null,null,null,null,null,null,null,null,null,null,null,null,null,null,null,null,null,null,null,null,null,null,null,null,null,null,null,null,null,null,null,{"$f":"F$8","v":22},{"$f":"F$9","v":15},{"$f":"J$8","v":29},{"$f":"J$9","v":23},{"$f":"N$8","v":26},{"$f":"N$9","v":19},{"$f":"R$8","v":30},{"$f":"R$9","v":24},{"$f":"V$8","v":27},{"$f":"V$9","v":21},{"$f":"Z$8","v":31},{"$f":"Z$9","v":25},{"$f":"AD$8","v":29},{"$f":"AD$9","v":23},{"$f":"AH$8","v":37},{"$f":"AH$9","v":29},{"$f":"AL$8","v":35},{"$f":"AL$9","v":28},36,29]
[null,null,null,null,null,null,null,null,null,null,null,null,null,null,null,null,null,null,null,null,null,null,null,null,null,null,null,null,null,null,null,null,null,null,null,null,null,null,null,null,null,null,null,null,null,null,null,null,null,null,{"$f":"F$8","v":22},{"$f":"F$9","v":15},{"$f":"J$8","v":29},{"$f":"J$9","v":23},{"$f":"N$8","v":26},{"$f":"N$9","v":19},{"$f":"R$8","v":30},{"$f":"R$9","v":24},{"$f":"V$8","v":27},{"$f":"V$9","v":21},{"$f":"Z$8","v":31},{"$f":"Z$9","v":25},{"$f":"AD$8","v":29},{"$f":"AD$9","v":23},{"$f":"AH$8","v":37},{"$f":"AH$9","v":29},{"$f":"AL$8","v":35},{"$f":"AL$9","v":28},36,29]
[null,null,null,null,null,null,null,null,null,null,null,null,null,null,null,null,null,null,null,null,null,null,null,null,null,null,null,null,null,null,null,null,null,null,null,null,null,null,null,null,null,null,null,null,null,null,null,null,null,null,{"$f":"F$8","v":22},{"$f":"F$9","v":15},{"$f":"J$8","v":29},{"$f":"J$9","v":23},{"$f":"N$8","v":26},{"$f":"N$9","v":19},{"$f":"R$8","v":30},{"$f":"R$9","v":24},{"$f":"V$8","v":27},{"$f":"V$9","v":21},{"$f":"Z$8","v":31},{"$f":"Z$9","v":25},{"$f":"AD$8","v":29},{"$f":"AD$9","v":23},{"$f":"AH$8","v":37},{"$f":"AH$9","v":29},{"$f":"AL$8","v":35},{"$f":"AL$9","v":28},36,29]
[null,null,null,null,null,null,null,null,null,null,null,null,null,null,null,null,null,null,null,null,null,null,null,null,null,null,null,null,null,null,null,null,null,null,null,null,null,null,null,null,null,null,null,null,null,null,null,null,null,null,{"$f":"F$8","v":22},{"$f":"F$9","v":15},{"$f":"J$8","v":29},{"$f":"J$9","v":23},{"$f":"N$8","v":26},{"$f":"N$9","v":19},{"$f":"R$8","v":30},{"$f":"R$9","v":24},{"$f":"V$8","v":27},{"$f":"V$9","v":21},{"$f":"Z$8","v":31},{"$f":"Z$9","v":25},{"$f":"AD$8","v":29},{"$f":"AD$9","v":23},{"$f":"AH$8","v":37},{"$f":"AH$9","v":29},{"$f":"AL$8","v":35},{"$f":"AL$9","v":28},36,29]
[null,null,null,null,null,null,null,null,null,null,null,null,null,null,null,null,null,null,null,null,null,null,null,null,null,null,null,null,null,null,null,null,null,null,null,null,null,null,null,null,null,null,null,null,null,null,null,null,null,null,{"$f":"F$8","v":22},{"$f":"F$9","v":15},{"$f":"J$8","v":29},{"$f":"J$9","v":23},{"$f":"N$8","v":26},{"$f":"N$9","v":19},{"$f":"R$8","v":30},{"$f":"R$9","v":24},{"$f":"V$8","v":27},{"$f":"V$9","v":21},{"$f":"Z$8","v":31},{"$f":"Z$9","v":25},{"$f":"AD$8","v":29},{"$f":"AD$9","v":23},{"$f":"AH$8","v":37},{"$f":"AH$9","v":29},{"$f":"AL$8","v":35},{"$f":"AL$9","v":28},36,29]
[null,null,null,null,null,null,null,null,null,null,null,null,null,null,null,null,null,null,null,null,null,null,null,null,null,null,null,null,null,null,null,null,null,null,null,null,null,null,null,null,null,null,null,null,null,null,null,null,null,null,{"$f":"F$8","v":22},{"$f":"F$9","v":15},{"$f":"J$8","v":29},{"$f":"J$9","v":23},{"$f":"N$8","v":26},{"$f":"N$9","v":19},{"$f":"R$8","v":30},{"$f":"R$9","v":24},{"$f":"V$8","v":27},{"$f":"V$9","v":21},{"$f":"Z$8","v":31},{"$f":"Z$9","v":25},{"$f":"AD$8","v":29},{"$f":"AD$9","v":23},{"$f":"AH$8","v":37},{"$f":"AH$9","v":29},{"$f":"AL$8","v":35},{"$f":"AL$9","v":28},36,29]

{"sheet":"ENTK","index":1,"n_rows":44,"n_cols":37,"rows_kept":44,"cut":false,"hidden":false,"merged":[[4,33,4,34],[4,35,4,36],[4,0,4,1],[4,3,4,22],[4,27,4,28],[4,29,4,30],[4,31,4,32]]}
["Enterokokker (ENTK)"]
["2019-10-01",null,null,"PA Jenum"]
["Registrér etter at måleverdiene er lagt inn"]
[]
["Ukentlig",null,null,"E. faecalis ATCC 29212",null,null,null,null,null,null,null,null,null,null,null,null,null,null,null,null,null,null,null,null,null,null,null,{"$f":"E6","v":"AMP      2"},null,{"$f":"I6","v":"W          5"},null,{"$f":"M6","v":"F       100"},null,{"$f":"Q6","v":"LZD    10"},null,"Gent H30"]
["Dato","Nr",null,"Ampicillin 2","AMP      2","Sonegrenser","Target","Trimetoprim 5","W          5","Sonegrenser","Target","Nitrofurantoin 100","F       100","Sonegrenser","Target","Linezolid 10","LZD    10","Sonegrenser","Target","Gentamicin High 30","CN       30","Sonegrenser","Target",null,null,null,null,"Høy","Lav","Høy","Lav","Høy","Lav","Høy","Lav","Høy","Lav"]
["Snitt","Siste 30",null,{"$f":"AVERAGE(D$15:D$44)","v":19.75},"+-2SD",{"$f":"IF(F8=\"\",\"\",IF(D7>(3+((F8+F9)/2)),\"NB\",IF(D7<(-3+((F8+F9)/2)),\"NB\",\"OK\")))","v":"OK"},18,{"$f":"AVERAGE(H$15:H$44)","v":29.75},"+-2SD",{"$f":"IF(J8=\"\",\"\",IF(H7>(3+((J8+J9)/2)),\"NB\",IF(H7<(-3+((J8+J9)/2)),\"NB\",\"OK\")))","v":"OK"},28,{"$f":"AVERAGE(L$15:L$44)","v":22.5},"+-2SD",{"$f":"IF(N8=\"\",\"\",IF(L7>(3+((N8+N9)/2)),\"NB\",IF(L7<(-3+((N8+N9)/2)),\"NB\",\"OK\")))","v":"OK"},21,{"$f":"AVERAGE(P$15:P$44)","v":22.5},"+-2SD",{"$f":"IF(R8=\"\",\"\",IF(P7>(3+((R8+R9)/2)),\"NB\",IF(P7<(-3+((R8+R9)/2)),\"NB\",\"OK\")))","v":"OK"},22,{"$f":"AVERAGE(T$15:T$44)","v":17.5},"+-2SD",{"$f":"IF(V8=\"\",\"\",IF(T7>(3+((V8+V9)/2)),\"NB\",IF(T7<(-3+((V8+V9)/2)),\"NB\",\"OK\")))","v":"OK"},15]
["SD","Siste 30",null,{"$f":"STDEV(D$15:D$44)","v":0.5},{"$f":"D7+(2*D8)","v":20.75},21,null,{"$f":"STDEV(H$15:H$44)","v":0.9574271077563381},{"$f":"H7+(2*H8)","v":31.664854215512676},32,null,{"$f":"STDEV(L$15:L$44)","v":0.57735026918962573},{"$f":"L7+(2*L8)","v":23.654700538379252},24,null,{"$f":"STDEV(P$15:P$44)","v":0.57735026918962573},{"$f":"P7+(2*P8)","v":23.654700538379252},25,null,{"$f":"STDEV(T$15:T$44)","v":0.57735026918962573},{"$f":"T7+(2*T8)","v":18.654700538379252},18]
["CV%",null,null,{"$f":"D8/D7","v":2.5316455696202531E-2},{"$f":"D7-(2*D8)","v":18.75},15,null,{"$f":"H8/H7","v":3.2182423790129012E-2},{"$f":"H7-(2*H8)","v":27.835145784487324},24,null,{"$f":"L8/L7","v":2.5660011963983365E-2},{"$f":"L7-(2*L8)","v":21.345299461620748},18,null,{"$f":"P8/P7","v":2.5660011963983365E-2},{"$f":"P7-(2*P8)","v":21.345299461620748},19,null,{"$f":"T8/T7","v":3.2991443953692898E-2},{"$f":"T7-(2*T8)","v":16.345299461620748},12]
[]
[]
["Legg inn diameter i hele millimeter i fargede felt i Rad 13"]
[]
[null,null,"Initialer, Avvik, Komm.",null,"Avvik","s30","RT",null,"Avvik","s30","RT",null,"Avvik","s30","RT",null,"Avvik","s30","RT",null,"Avvik","s30","RT"]
["2019-09-25",1,null,20,{"$f":"IF(D15=\"\",\"\",(D15-D$7)/D$7)","v":1.2658227848101266E-2},null,null,31,{"$f":"IF(H15=\"\",\"\",(H15-H$7)/H$7)","v":4.2016806722689079E-2},null,null,23,{"$f":"IF(L15=\"\",\"\",(L15-L$7)/L$7)","v":2.2222222222222223E-2},null,null,23,{"$f":"IF(P15=\"\",\"\",(P15-P$7)/P$7)","v":2.2222222222222223E-2},null,null,18,{"$f":"IF(T15=\"\",\"\",(T15-T$7)/T$7)","v":2.8571428571428571E-2},null,null,null,null,null,null,{"$f":"F$8","v":21},{"$f":"F$9","v":15},{"$f":"J$8","v":32},{"$f":"J$9","v":24},{"$f":"N$8","v":24},{"$f":"N$9","v":18},{"$f":"R$8","v":25},{"$f":"R$9","v":19},{"$f":"V$8","v":18},{"$f":"V$9","v":12}]
["2019-09-18",{"$f":"B15+1","v":2},null,20,{"$f":"IF(D16=\"\",\"\",(D16-D$7)/D$7)","v":1.2658227848101266E-2},null,null,30,{"$f":"IF(H16=\"\",\"\",(H16-H$7)/H$7)","v":8.4033613445378148E-3},null,null,22,{"$f":"IF(L16=\"\",\"\",(L16-L$7)/L$7)","v":-2.2222222222222223E-2},null,null,22,{"$f":"IF(P16=\"\",\"\",(P16-P$7)/P$7)","v":-2.2222222222222223E-2},null,null,17,{"$f":"IF(T16=\"\",\"\",(T16-T$7)/T$7)","v":-2.8571428571428571E-2},null,null,null,null,null,null,{"$f":"F$8","v":21},{"$f":"F$9","v":15},{"$f":"J$8","v":32},{"$f":"J$9","v":24},{"$f":"N$8","v":24},{"$f":"N$9","v":18},{"$f":"R$8","v":25},{"$f":"R$9","v":19},{"$f":"V$8","v":18},{"$f":"V$9","v":12}]
["2019-09-11",3,null,19,{"$f":"IF(D17=\"\",\"\",(D17-D$7)/D$7)","v":-3.7974683544303799E-2},null,null,29,{"$f":"IF(H17=\"\",\"\",(H17-H$7)/H$7)","v":-2.5210084033613446E-2},null,null,22,{"$f":"IF(L17=\"\",\"\",(L17-L$7)/L$7)","v":-2.2222222222222223E-2},null,null,22,{"$f":"IF(P17=\"\",\"\",(P17-P$7)/P$7)","v":-2.2222222222222223E-2},null,null,17,{"$f":"IF(T17=\"\",\"\",(T17-T$7)/T$7)","v":-2.8571428571428571E-2},null,null,null,null,null,null,{"$f":"F$8","v":21},{"$f":"F$9","v":15},{"$f":"J$8","v":32},{"$f":"J$9","v":24},{"$f":"N$8","v":24},{"$f":"N$9","v":18},{"$f":"R$8","v":25},{"$f":"R$9","v":19},{"$f":"V$8","v":18},{"$f":"V$9","v":12}]
["2019-09-04",4,null,20,{"$f":"IF(D18=\"\",\"\",(D18-D$7)/D$7)","v":1.2658227848101266E-2},null,null,29,{"$f":"IF(H18=\"\",\"\",(H18-H$7)/H$7)","v":-2.5210084033613446E-2},null,null,23,{"$f":"IF(L18=\"\",\"\",(L18-L$7)/L$7)","v":2.2222222222222223E-2},null,null,23,{"$f":"IF(P18=\"\",\"\",(P18-P$7)/P$7)","v":2.2222222222222223E-2},null,null,18,{"$f":"IF(T18=\"\",\"\",(T18-T$7)/T$7)","v":2.8571428571428571E-2},null,null,null,null,null,null,{"$f":"F$8","v":21},{"$f":"F$9","v":15},{"$f":"J$8","v":32},{"$f":"J$9","v":24},{"$f":"N$8","v":24},{"$f":"N$9","v":18},{"$f":"R$8","v":25},{"$f":"R$9","v":19},{"$f":"V$8","v":18},{"$f":"V$9","v":12}]
[null,null,null,null,null,null,null,null,null,null,null,null,null,null,null,null,null,null,null,null,null,null,null,null,null,null,null,{"$f":"F$8","v":21},{"$f":"F$9","v":15},{"$f":"J$8","v":32},{"$f":"J$9","v":24},{"$f":"N$8","v":24},{"$f":"N$9","v":18},{"$f":"R$8","v":25},{"$f":"R$9","v":19},{"$f":"V$8","v":18},{"$f":"V$9","v":12}]
[null,null,null,null,null,null,null,null,null,null,null,null,null,null,null,null,null,null,null,null,null,null,null,null,null,null,null,{"$f":"F$8","v":21},{"$f":"F$9","v":15},{"$f":"J$8","v":32},{"$f":"J$9","v":24},{"$f":"N$8","v":24},{"$f":"N$9","v":18},{"$f":"R$8","v":25},{"$f":"R$9","v":19},{"$f":"V$8","v":18},{"$f":"V$9","v":12}]
[null,null,null,null,null,null,null,null,null,null,null,null,null,null,null,null,null,null,null,null,null,null,null,null,null,null,null,{"$f":"F$8","v":21},{"$f":"F$9","v":15},{"$f":"J$8","v":32},{"$f":"J$9","v":24},{"$f":"N$8","v":24},{"$f":"N$9","v":18},{"$f":"R$8","v":25},{"$f":"R$9","v":19},{"$f":"V$8","v":18},{"$f":"V$9","v":12}]
[null,null,null,null,null,null,null,null,null,null,null,null,null,null,null,null,null,null,null,null,null,null,null,null,null,null,null,{"$f":"F$8","v":21},{"$f":"F$9","v":15},{"$f":"J$8","v":32},{"$f":"J$9","v":24},{"$f":"N$8","v":24},{"$f":"N$9","v":18},{"$f":"R$8","v":25},{"$f":"R$9","v":19},{"$f":"V$8","v":18},{"$f":"V$9","v":12}]
[null,null,null,null,null,null,null,null,null,null,null,null,null,null,null,null,null,null,null,null,null,null,null,null,null,null,null,{"$f":"F$8","v":21},{"$f":"F$9","v":15},{"$f":"J$8","v":32},{"$f":"J$9","v":24},{"$f":"N$8","v":24},{"$f":"N$9","v":18},{"$f":"R$8","v":25},{"$f":"R$9","v":19},{"$f":"V$8","v":18},{"$f":"V$9","v":12}]
[null,null,null,null,null,null,null,null,null,null,null,null,null,null,null,null,null,null,null,null,null,null,null,null,null,null,null,{"$f":"F$8","v":21},{"$f":"F$9","v":15},{"$f":"J$8","v":32},{"$f":"J$9","v":24},{"$f":"N$8","v":24},{"$f":"N$9","v":18},{"$f":"R$8","v":25},{"$f":"R$9","v":19},{"$f":"V$8","v":18},{"$f":"V$9","v":12}]
[null,null,null,null,null,null,null,null,null,null,null,null,null,null,null,null,null,null,null,null,null,null,null,null,null,null,null,{"$f":"F$8","v":21},{"$f":"F$9","v":15},{"$f":"J$8","v":32},{"$f":"J$9","v":24},{"$f":"N$8","v":24},{"$f":"N$9","v":18},{"$f":"R$8","v":25},{"$f":"R$9","v":19},{"$f":"V$8","v":18},{"$f":"V$9","v":12}]
[null,null,null,null,null,null,null,null,null,null,null,null,null,null,null,null,null,null,null,null,null,null,null,null,null,null,null,{"$f":"F$8","v":21},{"$f":"F$9","v":15},{"$f":"J$8","v":32},{"$f":"J$9","v":24},{"$f":"N$8","v":24},{"$f":"N$9","v":18},{"$f":"R$8","v":25},{"$f":"R$9","v":19},{"$f":"V$8","v":18},{"$f":"V$9","v":12}]
[null,null,null,null,null,null,null,null,null,null,null,null,null,null,null,null,null,null,null,null,null,null,null,null,null,null,null,{"$f":"F$8","v":21},{"$f":"F$9","v":15},{"$f":"J$8","v":32},{"$f":"J$9","v":24},{"$f":"N$8","v":24},{"$f":"N$9","v":18},{"$f":"R$8","v":25},{"$f":"R$9","v":19},{"$f":"V$8","v":18},{"$f":"V$9","v":12}]
[null,null,null,null,null,null,null,null,null,null,null,null,null,null,null,null,null,null,null,null,null,null,null,null,null,null,null,{"$f":"F$8","v":21},{"$f":"F$9","v":15},{"$f":"J$8","v":32},{"$f":"J$9","v":24},{"$f":"N$8","v":24},{"$f":"N$9","v":18},{"$f":"R$8","v":25},{"$f":"R$9","v":19},{"$f":"V$8","v":18},{"$f":"V$9","v":12}]
[null,null,null,null,null,null,null,null,null,null,null,null,null,null,null,null,null,null,null,null,null,null,null,null,null,null,null,{"$f":"F$8","v":21},{"$f":"F$9","v":15},{"$f":"J$8","v":32},{"$f":"J$9","v":24},{"$f":"N$8","v":24},{"$f":"N$9","v":18},{"$f":"R$8","v":25},{"$f":"R$9","v":19},{"$f":"V$8","v":18},{"$f":"V$9","v":12}]
[null,null,null,null,null,null,null,null,null,null,null,null,null,null,null,null,null,null,null,null,null,null,null,null,null,null,null,21,15,32,24,24,18,25,19,18,12]
[null,null,null,null,null,null,null,null,null,null,null,null,null,null,null,null,null,null,null,null,null,null,null,null,null,null,null,{"$f":"F$8","v":21},{"$f":"F$9","v":15},{"$f":"J$8","v":32},{"$f":"J$9","v":24},{"$f":"N$8","v":24},{"$f":"N$9","v":18},{"$f":"R$8","v":25},{"$f":"R$9","v":19},{"$f":"V$8","v":18},{"$f":"V$9","v":12}]
[null,null,null,null,null,null,null,null,null,null,null,null,null,null,null,null,null,null,null,null,null,null,null,null,null,null,null,21,{"$f":"F$9","v":15},32,24,24,18,25,19,18,12]
[null,null,null,null,null,null,null,null,null,null,null,null,null,null,null,null,null,null,null,null,null,null,null,null,null,null,null,21,15,32,24,24,18,25,19,18,12]
[null,null,null,null,null,null,null,null,null,null,null,null,null,null,null,null,null,null,null,null,null,null,null,null,null,null,null,{"$f":"F$8","v":21},15,{"$f":"J$8","v":32},{"$f":"J$9","v":24},{"$f":"N$8","v":24},{"$f":"N$9","v":18},{"$f":"R$8","v":25},{"$f":"R$9","v":19},{"$f":"V$8","v":18},{"$f":"V$9","v":12}]
[null,null,null,null,null,null,null,null,null,null,null,null,null,null,null,null,null,null,null,null,null,null,null,null,null,null,null,{"$f":"F$8","v":21},{"$f":"F$9","v":15},{"$f":"J$8","v":32},{"$f":"J$9","v":24},{"$f":"N$8","v":24},{"$f":"N$9","v":18},{"$f":"R$8","v":25},{"$f":"R$9","v":19},{"$f":"V$8","v":18},{"$f":"V$9","v":12}]
[null,null,null,null,null,null,null,null,null,null,null,null,null,null,null,null,null,null,null,null,null,null,null,null,null,null,null,{"$f":"F$8","v":21},{"$f":"F$9","v":15},{"$f":"J$8","v":32},{"$f":"J$9","v":24},{"$f":"N$8","v":24},{"$f":"N$9","v":18},{"$f":"R$8","v":25},{"$f":"R$9","v":19},{"$f":"V$8","v":18},{"$f":"V$9","v":12}]
[null,null,null,null,null,null,null,null,null,null,null,null,null,null,null,null,null,null,null,null,null,null,null,null,null,null,null,{"$f":"F$8","v":21},{"$f":"F$9","v":15},{"$f":"J$8","v":32},{"$f":"J$9","v":24},{"$f":"N$8","v":24},{"$f":"N$9","v":18},{"$f":"R$8","v":25},{"$f":"R$9","v":19},{"$f":"V$8","v":18},{"$f":"V$9","v":12}]
[null,null,null,null,null,null,null,null,null,null,null,null,null,null,null,null,null,null,null,null,null,null,null,null,null,null,null,{"$f":"F$8","v":21},{"$f":"F$9","v":15},{"$f":"J$8","v":32},{"$f":"J$9","v":24},{"$f":"N$8","v":24},{"$f":"N$9","v":18},{"$f":"R$8","v":25},{"$f":"R$9","v":19},{"$f":"V$8","v":18},{"$f":"V$9","v":12}]
[null,null,null,null,null,null,null,null,null,null,null,null,null,null,null,null,null,null,null,null,null,null,null,null,null,null,null,{"$f":"F$8","v":21},{"$f":"F$9","v":15},{"$f":"J$8","v":32},{"$f":"J$9","v":24},{"$f":"N$8","v":24},{"$f":"N$9","v":18},{"$f":"R$8","v":25},{"$f":"R$9","v":19},{"$f":"V$8","v":18},{"$f":"V$9","v":12}]
[null,null,null,null,null,null,null,null,null,null,null,null,null,null,null,null,null,null,null,null,null,null,null,null,null,null,null,{"$f":"F$8","v":21},{"$f":"F$9","v":15},{"$f":"J$8","v":32},{"$f":"J$9","v":24},{"$f":"N$8","v":24},{"$f":"N$9","v":18},{"$f":"R$8","v":25},{"$f":"R$9","v":19},{"$f":"V$8","v":18},{"$f":"V$9","v":12}]
[null,null,null,null,null,null,null,null,null,null,null,null,null,null,null,null,null,null,null,null,null,null,null,null,null,null,null,{"$f":"F$8","v":21},{"$f":"F$9","v":15},{"$f":"J$8","v":32},{"$f":"J$9","v":24},{"$f":"N$8","v":24},{"$f":"N$9","v":18},{"$f":"R$8","v":25},{"$f":"R$9","v":19},{"$f":"V$8","v":18},{"$f":"V$9","v":12}]
[null,null,null,null,null,null,null,null,null,null,null,null,null,null,null,null,null,null,null,null,null,null,null,null,null,null,null,{"$f":"F$8","v":21},{"$f":"F$9","v":15},{"$f":"J$8","v":32},{"$f":"J$9","v":24},{"$f":"N$8","v":24},{"$f":"N$9","v":18},{"$f":"R$8","v":25},{"$f":"R$9","v":19},{"$f":"V$8","v":18},{"$f":"V$9","v":12}]
[null,null,null,null,null,null,null,null,null,null,null,null,null,null,null,null,null,null,null,null,null,null,null,null,null,null,null,{"$f":"F$8","v":21},{"$f":"F$9","v":15},{"$f":"J$8","v":32},{"$f":"J$9","v":24},{"$f":"N$8","v":24},{"$f":"N$9","v":18},{"$f":"R$8","v":25},{"$f":"R$9","v":19},{"$f":"V$8","v":18},{"$f":"V$9","v":12}]
[null,null,null,null,null,null,null,null,null,null,null,null,null,null,null,null,null,null,null,null,null,null,null,null,null,null,null,{"$f":"F$8","v":21},{"$f":"F$9","v":15},{"$f":"J$8","v":32},{"$f":"J$9","v":24},{"$f":"N$8","v":24},{"$f":"N$9","v":18},{"$f":"R$8","v":25},{"$f":"R$9","v":19},{"$f":"V$8","v":18},{"$f":"V$9","v":12}]

{"sheet":"HAEMO","index":2,"n_rows":44,"n_cols":55,"rows_kept":44,"cut":false,"hidden":false,"merged":[[4,53,4,54],[4,49,4,50],[4,51,4,52],[4,0,4,1],[4,43,4,44],[4,45,4,46],[4,47,4,48],[4,3,4,26]]}
["Haemophilus influenzae (HAEMO)"]
["2019-10-01",null,null,"PA Jenum"]
["Registrér etter at måleverdiene er lagt inn"]
[]
["Ukentlig",null,null,"H.influenzae ATCC 49766 ",null,null,null,null,null,null,null,null,null,null,null,null,null,null,null,null,null,null,null,null,null,null,null,null,null,null,null,null,null,null,null,null,null,null,null,null,null,null,null,{"$f":"E6","v":"P 1"},null,{"$f":"I6","v":"SXT 25"},null,{"$f":"M6","v":"TE 30"},null,{"$f":"Q6","v":"CIP 5"},null,{"$f":"U6","v":"CEC 30"},null,"CXM 30"]
["Dato","Nr",null,"Penicillin G 1 µg","P 1","Sonegrenser","Target","Trim-sulfa","SXT 25","Sonegrenser","Target","Tetracyclin 30","TE 30","Sonegrenser","Target","Ciprofloxacin","CIP 5","Sonegrenser","Target","Cefaclor 30","CEC 30","Sonegrenser","Target","Cefuroxime 30","CXM 30","Sonegrenser","Target",null,null,null,null,null,null,null,null,null,null,null,null,null,null,null,null,"Øvre","Nedre","Øvre","Nedre","Øvre","Nedre","Øvre","Nedre","Øvre","Nedre","Øvre","Nedre"]
["Snitt","Siste 30",null,{"$f":"AVERAGE(D$15:D$44)","v":17.25},"+-2SD",{"$f":"IF(F8=\"\",\"\",IF(D7>(3+((F8+F9)/2)),\"NB\",IF(D7<(-3+((F8+F9)/2)),\"NB\",\"OK\")))","v":"OK"},18,{"$f":"AVERAGE(H$15:H$44)","v":31.25},"+-2SD",{"$f":"IF(J8=\"\",\"\",IF(H7>(3+((J8+J9)/2)),\"NB\",IF(H7<(-3+((J8+J9)/2)),\"NB\",\"OK\")))","v":"OK"},31,{"$f":"AVERAGE(L$15:L$44)","v":29.75},"+-2SD",{"$f":"IF(N8=\"\",\"\",IF(L7>(3+((N8+N9)/2)),\"NB\",IF(L7<(-3+((N8+N9)/2)),\"NB\",\"OK\")))","v":"OK"},31,{"$f":"AVERAGE(P$15:P$44)","v":34.75},"+-2SD",{"$f":"IF(R8=\"\",\"\",IF(P7>(3+((R8+R9)/2)),\"NB\",IF(P7<(-3+((R8+R9)/2)),\"NB\",\"OK\")))","v":"OK"},36,{"$f":"AVERAGE(T$15:T$44)","v":25.5},"+-2SD",{"$f":"IF(V8=\"\",\"\",IF(T7>(3+((V8+V9)/2)),\"NB\",IF(T7<(-3+((V8+V9)/2)),\"NB\",\"OK\")))","v":"OK"},27,{"$f":"AVERAGE(X$15:X43)","v":28.75},"+-2SD",{"$f":"IF(Z8=\"\",\"\",IF(X7>(3+((Z8+Z9)/2)),\"NB\",IF(X7<(-3+((Z8+Z9)/2)),\"NB\",\"OK\")))","v":"OK"},30]
["SD","Siste 30",null,{"$f":"STDEV(D$15:D$44)","v":0.5},{"$f":"D7+(2*D8)","v":18.25},21,null,{"$f":"STDEV(H$15:H$44)","v":0.5},{"$f":"H7+(2*H8)","v":32.25},35,null,{"$f":"STDEV(L$15:L$44)","v":0.5},{"$f":"L7+(2*L8)","v":30.75},34,null,{"$f":"STDEV(P$15:P$44)","v":0.5},{"$f":"P7+(2*P8)","v":35.75},40,null,{"$f":"STDEV(T$15:T$44)","v":0.57735026918962573},{"$f":"T7+(2*T8)","v":26.654700538379252},30,null,{"$f":"STDEV(X$15:X43)","v":0.9574271077563381},{"$f":"X7+(2*X8)","v":30.664854215512676},34]
["CV%",null,null,{"$f":"D8/D7","v":2.8985507246376812E-2},{"$f":"D7-(2*D8)","v":16.25},15,null,{"$f":"H8/H7","v":1.6E-2},{"$f":"H7-(2*H8)","v":30.25},27,null,{"$f":"L8/L7","v":1.680672268907563E-2},{"$f":"L7-(2*L8)","v":28.75},28,null,{"$f":"P8/P7","v":1.4388489208633094E-2},{"$f":"P7-(2*P8)","v":33.75},32,null,{"$f":"T8/T7","v":2.2641187027044145E-2},{"$f":"T7-(2*T8)","v":24.345299461620748},24,null,{"$f":"X8/X7","v":3.3301812443698717E-2},{"$f":"X7-(2*X8)","v":26.835145784487324},26]
[]
[]
["Legg inn diameter i hele millimeter i fargede felt i Rad 13"]
[]
[null,null,"Initialer, Avvik, Komm.",null,"Avvik","s30","RT",null,"Avvik","s30","RT",null,"Avvik","s30","RT",null,"Avvik","s30","RT",null,"Avvik","s30","RT",null,"Avvik","s30","RT"]
["2019-09-25",1,null,17,{"$f":"(D15-$D$7)/$D$7","v":-1.4492753623188406E-2},{"$f":"IF((ABS(E15)>($D$9*3)),\"AV\",IF((ABS(E15)>($D$9*2)),\"NB\",\"\"))","v":""},"",31,{"$f":"(H15-$H$7)/$H$7","v":-8.0000000000000002E-3},{"$f":"IF((ABS(I15)>($H$9*3)),\"AV\",IF((ABS(I15)>($H$9*2)),\"NB\",\"\"))","v":""},"",30,{"$f":"(L15-$L$7)/$L$7","v":8.4033613445378148E-3},{"$f":"IF((ABS(M15)>($L$9*3)),\"AV\",IF((ABS(M15)>($L$9*2)),\"NB\",\"\"))","v":""},"",35,{"$f":"(P15-$P$7)/$P$7","v":7.1942446043165471E-3},{"$f":"IF((ABS(Q15)>($P$9*3)),\"AV\",IF((ABS(Q15)>($P$9*2)),\"NB\",\"\"))","v":""},"",26,{"$f":"(T15-$T$7)/$T$7","v":1.9607843137254902E-2},{"$f":"IF((ABS(U15)>($T$9*3)),\"AV\",IF((ABS(U15)>($T$9*2)),\"NB\",\"\"))","v":""},"",30,{"$f":"(X15-$X$7)/$X$7","v":4.3478260869565216E-2},{"$f":"IF((ABS(Y15)>($X$9*3)),\"AV\",IF((ABS(Y15)>($X$9*2)),\"NB\",\"\"))","v":""},null,null,null,null,null,null,null,null,null,null,null,null,null,null,null,null,null,{"$f":"F$8","v":21},{"$f":"F$9","v":15},{"$f":"J$8","v":35},{"$f":"J$9","v":27},{"$f":"N$8","v":34},{"$f":"N$9","v":28},{"$f":"R$8","v":40},{"$f":"R$9","v":32},{"$f":"V$8","v":30},{"$f":"V$9","v":24},{"$f":"Z$8","v":34},{"$f":"Z$9","v":26}]
["2019-09-18",{"$f":"B15+1","v":2},null,18,{"$f":"(D16-$D$7)/$D$7","v":4.3478260869565216E-2},{"$f":"IF((ABS(E16)>($D$9*3)),\"AV\",IF((ABS(E16)>($D$9*2)),\"NB\",\"\"))","v":""},"",32,{"$f":"(H16-$H$7)/$H$7","v":2.4E-2},{"$f":"IF((ABS(I16)>($H$9*3)),\"AV\",IF((ABS(I16)>($H$9*2)),\"NB\",\"\"))","v":""},null,29,{"$f":"(L16-$L$7)/$L$7","v":-2.5210084033613446E-2},{"$f":"IF((ABS(M16)>($L$9*3)),\"AV\",IF((ABS(M16)>($L$9*2)),\"NB\",\"\"))","v":""},"",35,{"$f":"(P16-$P$7)/$P$7","v":7.1942446043165471E-3},{"$f":"IF((ABS(Q16)>($P$9*3)),\"AV\",IF((ABS(Q16)>($P$9*2)),\"NB\",\"\"))","v":""},"",25,{"$f":"(T16-$T$7)/$T$7","v":-1.9607843137254902E-2},{"$f":"IF((ABS(U16)>($T$9*3)),\"AV\",IF((ABS(U16)>($T$9*2)),\"NB\",\"\"))","v":""},"",28,{"$f":"(X16-$X$7)/$X$7","v":-2.6086956521739129E-2},{"$f":"IF((ABS(Y16)>($X$9*3)),\"AV\",IF((ABS(Y16)>($X$9*2)),\"NB\",\"\"))","v":""},"",null,null,null,null,null,null,null,null,null,null,null,null,null,null,null,null,{"$f":"F$8","v":21},{"$f":"F$9","v":15},{"$f":"J$8","v":35},{"$f":"J$9","v":27},{"$f":"N$8","v":34},{"$f":"N$9","v":28},{"$f":"R$8","v":40},{"$f":"R$9","v":32},{"$f":"V$8","v":30},{"$f":"V$9","v":24},{"$f":"Z$8","v":34},{"$f":"Z$9","v":26}]
["2019-09-04",3,null,17,{"$f":"(D17-$D$7)/$D$7","v":-1.4492753623188406E-2},{"$f":"IF((ABS(E17)>($D$9*3)),\"AV\",IF((ABS(E17)>($D$9*2)),\"NB\",\"\"))","v":""},"",31,{"$f":"(H17-$H$7)/$H$7","v":-8.0000000000000002E-3},{"$f":"IF((ABS(I17)>($H$9*3)),\"AV\",IF((ABS(I17)>($H$9*2)),\"NB\",\"\"))","v":""},"",30,{"$f":"(L17-$L$7)/$L$7","v":8.4033613445378148E-3},{"$f":"IF((ABS(M17)>($L$9*3)),\"AV\",IF((ABS(M17)>($L$9*2)),\"NB\",\"\"))","v":""},"",35,{"$f":"(P17-$P$7)/$P$7","v":7.1942446043165471E-3},{"$f":"IF((ABS(Q17)>($P$9*3)),\"AV\",IF((ABS(Q17)>($P$9*2)),\"NB\",\"\"))","v":""},"",25,{"$f":"(T17-$T$7)/$T$7","v":-1.9607843137254902E-2},{"$f":"IF((ABS(U17)>($T$9*3)),\"AV\",IF((ABS(U17)>($T$9*2)),\"NB\",\"\"))","v":""},"",28,{"$f":"(X17-$X$7)/$X$7","v":-2.6086956521739129E-2},{"$f":"IF((ABS(Y17)>($X$9*3)),\"AV\",IF((ABS(Y17)>($X$9*2)),\"NB\",\"\"))","v":""},"",null,null,null,null,null,null,null,null,null,null,null,null,null,null,null,null,{"$f":"F$8","v":21},{"$f":"F$9","v":15},{"$f":"J$8","v":35},{"$f":"J$9","v":27},{"$f":"N$8","v":34},{"$f":"N$9","v":28},{"$f":"R$8","v":40},{"$f":"R$9","v":32},{"$f":"V$8","v":30},{"$f":"V$9","v":24},{"$f":"Z$8","v":34},{"$f":"Z$9","v":26}]
["2019-08-28",4,null,17,{"$f":"(D18-$D$7)/$D$7","v":-1.4492753623188406E-2},{"$f":"IF((ABS(E18)>($D$9*3)),\"AV\",IF((ABS(E18)>($D$9*2)),\"NB\",\"\"))","v":""},"",31,{"$f":"(H18-$H$7)/$H$7","v":-8.0000000000000002E-3},{"$f":"IF((ABS(I18)>($H$9*3)),\"AV\",IF((ABS(I18)>($H$9*2)),\"NB\",\"\"))","v":""},"",30,{"$f":"(L18-$L$7)/$L$7","v":8.4033613445378148E-3},{"$f":"IF((ABS(M18)>($L$9*3)),\"AV\",IF((ABS(M18)>($L$9*2)),\"NB\",\"\"))","v":""},"",34,{"$f":"(P18-$P$7)/$P$7","v":-2.1582733812949641E-2},{"$f":"IF((ABS(Q18)>($P$9*3)),\"AV\",IF((ABS(Q18)>($P$9*2)),\"NB\",\"\"))","v":""},"",26,{"$f":"(T18-$T$7)/$T$7","v":1.9607843137254902E-2},{"$f":"IF((ABS(U18)>($T$9*3)),\"AV\",IF((ABS(U18)>($T$9*2)),\"NB\",\"\"))","v":""},"",29,{"$f":"(X18-$X$7)/$X$7","v":8.6956521739130436E-3},{"$f":"IF((ABS(Y18)>($X$9*3)),\"AV\",IF((ABS(Y18)>($X$9*2)),\"NB\",\"\"))","v":""},"",null,null,null,null,null,null,null,null,null,null,null,null,null,null,null,null,{"$f":"F$8","v":21},{"$f":"F$9","v":15},{"$f":"J$8","v":35},{"$f":"J$9","v":27},{"$f":"N$8","v":34},{"$f":"N$9","v":28},{"$f":"R$8","v":40},{"$f":"R$9","v":32},{"$f":"V$8","v":30},{"$f":"V$9","v":24},{"$f":"Z$8","v":34},{"$f":"Z$9","v":26}]
[null,null,null,null,null,null,null,null,null,null,null,null,null,null,null,null,null,null,null,null,null,null,null,null,null,null,null,null,null,null,null,null,null,null,null,null,null,null,null,null,null,null,null,{"$f":"F$8","v":21},{"$f":"F$9","v":15},{"$f":"J$8","v":35},{"$f":"J$9","v":27},{"$f":"N$8","v":34},{"$f":"N$9","v":28},{"$f":"R$8","v":40},{"$f":"R$9","v":32},{"$f":"V$8","v":30},{"$f":"V$9","v":24},{"$f":"Z$8","v":34},{"$f":"Z$9","v":26}]
[null,null,null,null,null,null,null,null,null,null,null,null,null,null,null,null,null,null,null,null,null,null,null,null,null,null,null,null,null,null,null,null,null,null,null,null,null,null,null,null,null,null,null,{"$f":"F$8","v":21},{"$f":"F$9","v":15},{"$f":"J$8","v":35},{"$f":"J$9","v":27},{"$f":"N$8","v":34},{"$f":"N$9","v":28},{"$f":"R$8","v":40},{"$f":"R$9","v":32},{"$f":"V$8","v":30},{"$f":"V$9","v":24},{"$f":"Z$8","v":34},{"$f":"Z$9","v":26}]
[null,null,null,null,null,null,null,null,null,null,null,null,null,null,null,null,null,null,null,null,null,null,null,null,null,null,null,null,null,null,null,null,null,null,null,null,null,null,null,null,null,null,null,{"$f":"F$8","v":21},{"$f":"F$9","v":15},{"$f":"J$8","v":35},{"$f":"J$9","v":27},{"$f":"N$8","v":34},{"$f":"N$9","v":28},{"$f":"R$8","v":40},{"$f":"R$9","v":32},{"$f":"V$8","v":30},{"$f":"V$9","v":24},{"$f":"Z$8","v":34},{"$f":"Z$9","v":26}]
[null,null,null,null,null,null,null,null,null,null,null,null,null,null,null,null,null,null,null,null,null,null,null,null,null,null,null,null,null,null,null,null,null,null,null,null,null,null,null,null,null,null,null,{"$f":"F$8","v":21},{"$f":"F$9","v":15},{"$f":"J$8","v":35},{"$f":"J$9","v":27},{"$f":"N$8","v":34},{"$f":"N$9","v":28},{"$f":"R$8","v":40},{"$f":"R$9","v":32},{"$f":"V$8","v":30},{"$f":"V$9","v":24},{"$f":"Z$8","v":34},{"$f":"Z$9","v":26}]
[null,null,null,null,null,null,null,null,null,null,null,null,null,null,null,null,null,null,null,null,null,null,null,null,null,null,null,null,null,null,null,null,null,null,null,null,null,null,null,null,null,null,null,{"$f":"F$8","v":21},{"$f":"F$9","v":15},{"$f":"J$8","v":35},{"$f":"J$9","v":27},{"$f":"N$8","v":34},{"$f":"N$9","v":28},{"$f":"R$8","v":40},{"$f":"R$9","v":32},{"$f":"V$8","v":30},{"$f":"V$9","v":24},{"$f":"Z$8","v":34},{"$f":"Z$9","v":26}]
[null,null,null,null,null,null,null,null,null,null,null,null,null,null,null,null,null,null,null,null,null,null,null,null,null,null,null,null,null,null,null,null,null,null,null,null,null,null,null,null,null,null,null,{"$f":"F$8","v":21},{"$f":"F$9","v":15},{"$f":"J$8","v":35},{"$f":"J$9","v":27},{"$f":"N$8","v":34},{"$f":"N$9","v":28},{"$f":"R$8","v":40},{"$f":"R$9","v":32},{"$f":"V$8","v":30},{"$f":"V$9","v":24},{"$f":"Z$8","v":34},{"$f":"Z$9","v":26}]
[null,null,null,null,null,null,null,null,null,null,null,null,null,null,null,null,null,null,null,null,null,null,null,null,null,null,null,null,null,null,null,null,null,null,null,null,null,null,null,null,null,null,null,{"$f":"F$8","v":21},{"$f":"F$9","v":15},{"$f":"J$8","v":35},{"$f":"J$9","v":27},{"$f":"N$8","v":34},{"$f":"N$9","v":28},{"$f":"R$8","v":40},{"$f":"R$9","v":32},{"$f":"V$8","v":30},{"$f":"V$9","v":24},{"$f":"Z$8","v":34},{"$f":"Z$9","v":26}]
[null,null,null,null,null,null,null,null,null,null,null,null,null,null,null,null,null,null,null,null,null,null,null,null,null,null,null,null,null,null,null,null,null,null,null,null,null,null,null,null,null,null,null,{"$f":"F$8","v":21},{"$f":"F$9","v":15},{"$f":"J$8","v":35},{"$f":"J$9","v":27},{"$f":"N$8","v":34},{"$f":"N$9","v":28},{"$f":"R$8","v":40},{"$f":"R$9","v":32},{"$f":"V$8","v":30},{"$f":"V$9","v":24},{"$f":"Z$8","v":34},{"$f":"Z$9","v":26}]
[null,null,null,null,null,null,null,null,null,null,null,null,null,null,null,null,null,null,null,null,null,null,null,null,null,null,null,null,null,null,null,null,null,null,null,null,null,null,null,null,null,null,null,{"$f":"F$8","v":21},{"$f":"F$9","v":15},{"$f":"J$8","v":35},{"$f":"J$9","v":27},{"$f":"N$8","v":34},{"$f":"N$9","v":28},{"$f":"R$8","v":40},{"$f":"R$9","v":32},{"$f":"V$8","v":30},{"$f":"V$9","v":24},{"$f":"Z$8","v":34},{"$f":"Z$9","v":26}]
[null,null,null,null,null,null,null,null,null,null,null,null,null,null,null,null,null,null,null,null,null,null,null,null,null,null,null,null,null,null,null,null,null,null,null,null,null,null,null,null,null,null,null,{"$f":"F$8","v":21},{"$f":"F$9","v":15},{"$f":"J$8","v":35},{"$f":"J$9","v":27},{"$f":"N$8","v":34},{"$f":"N$9","v":28},{"$f":"R$8","v":40},{"$f":"R$9","v":32},{"$f":"V$8","v":30},{"$f":"V$9","v":24},{"$f":"Z$8","v":34},{"$f":"Z$9","v":26}]
[null,null,null,null,null,null,null,null,null,null,null,null,null,null,null,null,null,null,null,null,null,null,null,null,null,null,null,null,null,null,null,null,null,null,null,null,null,null,null,null,null,null,null,{"$f":"F$8","v":21},{"$f":"F$9","v":15},{"$f":"J$8","v":35},{"$f":"J$9","v":27},{"$f":"N$8","v":34},{"$f":"N$9","v":28},{"$f":"R$8","v":40},{"$f":"R$9","v":32},{"$f":"V$8","v":30},{"$f":"V$9","v":24},{"$f":"Z$8","v":34},{"$f":"Z$9","v":26}]
[null,null,null,null,null,null,null,null,null,null,null,null,null,null,null,null,null,null,null,null,null,null,null,null,null,null,null,null,null,null,null,null,null,null,null,null,null,null,null,null,null,null,null,{"$f":"F$8","v":21},{"$f":"F$9","v":15},{"$f":"J$8","v":35},{"$f":"J$9","v":27},{"$f":"N$8","v":34},{"$f":"N$9","v":28},{"$f":"R$8","v":40},{"$f":"R$9","v":32},{"$f":"V$8","v":30},{"$f":"V$9","v":24},{"$f":"Z$8","v":34},{"$f":"Z$9","v":26}]
[null,null,null,null,null,null,null,null,null,null,null,null,null,null,null,null,null,null,null,null,null,null,null,null,null,null,null,null,null,null,null,null,null,null,null,null,null,null,null,null,null,null,null,{"$f":"F$8","v":21},{"$f":"F$9","v":15},{"$f":"J$8","v":35},{"$f":"J$9","v":27},{"$f":"N$8","v":34},{"$f":"N$9","v":28},{"$f":"R$8","v":40},{"$f":"R$9","v":32},{"$f":"V$8","v":30},{"$f":"V$9","v":24},{"$f":"Z$8","v":34},{"$f":"Z$9","v":26}]
[null,null,null,null,null,null,null,null,null,null,null,null,null,null,null,null,null,null,null,null,null,null,null,null,null,null,null,null,null,null,null,null,null,null,null,null,null,null,null,null,null,null,null,{"$f":"F$8","v":21},{"$f":"F$9","v":15},{"$f":"J$8","v":35},{"$f":"J$9","v":27},{"$f":"N$8","v":34},{"$f":"N$9","v":28},{"$f":"R$8","v":40},{"$f":"R$9","v":32},{"$f":"V$8","v":30},{"$f":"V$9","v":24},{"$f":"Z$8","v":34},{"$f":"Z$9","v":26}]
[null,null,null,null,null,null,null,null,null,null,null,null,null,null,null,null,null,null,null,null,null,null,null,null,null,null,null,null,null,null,null,null,null,null,null,null,null,null,null,null,null,null,null,{"$f":"F$8","v":21},{"$f":"F$9","v":15},{"$f":"J$8","v":35},{"$f":"J$9","v":27},{"$f":"N$8","v":34},{"$f":"N$9","v":28},{"$f":"R$8","v":40},{"$f":"R$9","v":32},{"$f":"V$8","v":30},{"$f":"V$9","v":24},{"$f":"Z$8","v":34},{"$f":"Z$9","v":26}]
[null,null,null,null,null,null,null,null,null,null,null,null,null,null,null,null,null,null,null,null,null,null,null,null,null,null,null,null,null,null,null,null,null,null,null,null,null,null,null,null,null,null,null,{"$f":"F$8","v":21},{"$f":"F$9","v":15},{"$f":"J$8","v":35},{"$f":"J$9","v":27},{"$f":"N$8","v":34},{"$f":"N$9","v":28},{"$f":"R$8","v":40},{"$f":"R$9","v":32},{"$f":"V$8","v":30},{"$f":"V$9","v":24},{"$f":"Z$8","v":34},{"$f":"Z$9","v":26}]
[null,null,null,null,null,null,null,null,null,null,null,null,null,null,null,null,null,null,null,null,null,null,null,null,null,null,null,null,null,null,null,null,null,null,null,null,null,null,null,null,null,null,null,{"$f":"F$8","v":21},{"$f":"F$9","v":15},{"$f":"J$8","v":35},{"$f":"J$9","v":27},{"$f":"N$8","v":34},{"$f":"N$9","v":28},{"$f":"R$8","v":40},{"$f":"R$9","v":32},{"$f":"V$8","v":30},{"$f":"V$9","v":24},{"$f":"Z$8","v":34},{"$f":"Z$9","v":26}]
[null,null,null,null,null,null,null,null,null,null,null,null,null,null,null,null,null,null,null,null,null,null,null,null,null,null,null,null,null,null,null,null,null,null,null,null,null,null,null,null,null,null,null,{"$f":"F$8","v":21},{"$f":"F$9","v":15},{"$f":"J$8","v":35},{"$f":"J$9","v":27},{"$f":"N$8","v":34},{"$f":"N$9","v":28},{"$f":"R$8","v":40},{"$f":"R$9","v":32},{"$f":"V$8","v":30},{"$f":"V$9","v":24},{"$f":"Z$8","v":34},{"$f":"Z$9","v":26}]
[null,null,null,null,null,null,null,null,null,null,null,null,null,null,null,null,null,null,null,null,null,null,null,null,null,null,null,null,null,null,null,null,null,null,null,null,null,null,null,null,null,null,null,{"$f":"F$8","v":21},{"$f":"F$9","v":15},{"$f":"J$8","v":35},{"$f":"J$9","v":27},{"$f":"N$8","v":34},{"$f":"N$9","v":28},{"$f":"R$8","v":40},{"$f":"R$9","v":32},{"$f":"V$8","v":30},{"$f":"V$9","v":24},{"$f":"Z$8","v":34},{"$f":"Z$9","v":26}]
[null,null,null,null,null,null,null,null,null,null,null,null,null,null,null,null,null,null,null,null,null,null,null,null,null,null,null,null,null,null,null,null,null,null,null,null,null,null,null,null,null,null,null,{"$f":"F$8","v":21},{"$f":"F$9","v":15},{"$f":"J$8","v":35},{"$f":"J$9","v":27},{"$f":"N$8","v":34},{"$f":"N$9","v":28},{"$f":"R$8","v":40},{"$f":"R$9","v":32},{"$f":"V$8","v":30},{"$f":"V$9","v":24},{"$f":"Z$8","v":34},{"$f":"Z$9","v":26}]
[null,null,null,null,null,null,null,null,null,null,null,null,null,null,null,null,null,null,null,null,null,null,null,null,null,null,null,null,null,null,null,null,null,null,null,null,null,null,null,null,null,null,null,{"$f":"F$8","v":21},{"$f":"F$9","v":15},{"$f":"J$8","v":35},{"$f":"J$9","v":27},{"$f":"N$8","v":34},{"$f":"N$9","v":28},{"$f":"R$8","v":40},{"$f":"R$9","v":32},{"$f":"V$8","v":30},{"$f":"V$9","v":24},{"$f":"Z$8","v":34},{"$f":"Z$9","v":26}]
[null,null,null,null,null,null,null,null,null,null,null,null,null,null,null,null,null,null,null,null,null,null,null,null,null,null,null,null,null,null,null,null,null,null,null,null,null,null,null,null,null,null,null,{"$f":"F$8","v":21},{"$f":"F$9","v":15},{"$f":"J$8","v":35},{"$f":"J$9","v":27},{"$f":"N$8","v":34},{"$f":"N$9","v":28},{"$f":"R$8","v":40},{"$f":"R$9","v":32},{"$f":"V$8","v":30},{"$f":"V$9","v":24},{"$f":"Z$8","v":34},{"$f":"Z$9","v":26}]
[null,null,null,null,null,null,null,null,null,null,null,null,null,null,null,null,null,null,null,null,null,null,null,null,null,null,null,null,null,null,null,null,null,null,null,null,null,null,null,null,null,null,null,{"$f":"F$8","v":21},{"$f":"F$9","v":15},{"$f":"J$8","v":35},{"$f":"J$9","v":27},{"$f":"N$8","v":34},{"$f":"N$9","v":28},{"$f":"R$8","v":40},{"$f":"R$9","v":32},{"$f":"V$8","v":30},{"$f":"V$9","v":24},{"$f":"Z$8","v":34},{"$f":"Z$9","v":26}]
[null,null,null,null,null,null,null,null,null,null,null,null,null,null,null,null,null,null,null,null,null,null,null,null,null,null,null,null,null,null,null,null,null,null,null,null,null,null,null,null,null,null,null,{"$f":"F$8","v":21},{"$f":"F$9","v":15},{"$f":"J$8","v":35},{"$f":"J$9","v":27},{"$f":"N$8","v":34},{"$f":"N$9","v":28},{"$f":"R$8","v":40},{"$f":"R$9","v":32},{"$f":"V$8","v":30},{"$f":"V$9","v":24},{"$f":"Z$8","v":34},{"$f":"Z$9","v":26}]
[null,null,null,null,null,null,null,null,null,null,null,null,null,null,null,null,null,null,null,null,null,null,null,null,null,null,null,null,null,null,null,null,null,null,null,null,null,null,null,null,null,null,null,{"$f":"F$8","v":21},{"$f":"F$9","v":15},{"$f":"J$8","v":35},{"$f":"J$9","v":27},{"$f":"N$8","v":34},{"$f":"N$9","v":28},{"$f":"R$8","v":40},{"$f":"R$9","v":32},{"$f":"V$8","v":30},{"$f":"V$9","v":24},{"$f":"Z$8","v":34},{"$f":"Z$9","v":26}]
[null,null,null,null,null,null,null,null,null,null,null,null,null,null,null,null,null,null,null,null,null,null,null,null,null,null,null,null,null,null,null,null,null,null,null,null,null,null,null,null,null,null,null,{"$f":"F$8","v":21},{"$f":"F$9","v":15},{"$f":"J$8","v":35},{"$f":"J$9","v":27},{"$f":"N$8","v":34},{"$f":"N$9","v":28},{"$f":"R$8","v":40},{"$f":"R$9","v":32},{"$f":"V$8","v":30},{"$f":"V$9","v":24},{"$f":"Z$8","v":34},{"$f":"Z$9","v":26}]

{"sheet":"PSEUD","index":3,"n_rows":44,"n_cols":50,"rows_kept":44,"cut":false,"hidden":false,"merged":[[4,46,4,47],[4,48,4,49],[4,0,4,1],[4,3,4,26],[4,38,4,39],[4,40,4,41],[4,42,4,43],[4,44,4,45]]}
["Pseudomonas (PSEUD)"]
["2019-10-01",null,null,"PA Jenum"]
["Registrér etter at måleverdiene er lagt inn"]
[]
["Ukentlig",null,null,"P.aeruginosa  ATCC 27853",null,null,null,null,null,null,null,null,null,null,null,null,null,null,null,null,null,null,null,null,null,null,null,null,null,null,null,null,null,null,null,null,null,null,"CIP",null,"TZP",null,"CAZ",null,"MEM",null,"CN",null,"IMP"]
["Dato","Nr",null,"Ciprofloxacin 5","CIP        5","Sonegrenser","Target","Piperacillin Tazobactam","TZP    36","Sonegrenser","Target","Ceftazidim 10","CAZ   10","Sonegrenser","Target","Meropenem 10","MEM 10","Sonegrenser","Target","Tobramycin 10","TOB  10","Sonegrenser","Target","Imipenem 10","IPM 10","Sonegrenser","Target",null,null,null,null,null,null,null,null,null,null,null,"Øvre","Nedre","Øvre","Nedre","Øvre","Nedre","Øvre","Nedre","Øvre","Nedre","Øvre","Nedre"]
["Snitt","Siste 30",null,{"$f":"AVERAGE(D$15:D$44)","v":29.75},"+-2SD",{"$f":"IF(F8=\"\",\"\",IF(D7>(3+((F8+F9)/2)),\"NB\",IF(D7<(-3+((F8+F9)/2)),\"NB\",\"OK\")))","v":"OK"},29,{"$f":"AVERAGE(H$15:H$44)","v":25.75},"+-2SD",{"$f":"IF(J8=\"\",\"\",IF(H7>(3+((J8+J9)/2)),\"NB\",IF(H7<(-3+((J8+J9)/2)),\"NB\",\"OK\")))","v":"OK"},26,{"$f":"AVERAGE(L$15:L$44)","v":23.75},"+-2SD",{"$f":"IF(N8=\"\",\"\",IF(L7>(3+((N8+N9)/2)),\"NB\",IF(L7<(-3+((N8+N9)/2)),\"NB\",\"OK\")))","v":"OK"},24,{"$f":"AVERAGE(P$15:P$44)","v":28.25},"+-2SD",{"$f":"IF(R8=\"\",\"\",IF(P7>(3+((R8+R9)/2)),\"NB\",IF(P7<(-3+((R8+R9)/2)),\"NB\",\"OK\")))","v":"OK"},30,{"$f":"AVERAGE(T$15:T$44)","v":23},"+-2SD",{"$f":"IF(V8=\"\",\"\",IF(T7>(3+((V8+V9)/2)),\"NB\",IF(T7<(-3+((V8+V9)/2)),\"NB\",\"OK\")))","v":"OK"},23,{"$f":"AVERAGE(X$15:X$44)","v":23},"+-2SD",{"$f":"IF(Z8=\"\",\"\",IF(X7>(3+((Z8+Z9)/2)),\"NB\",IF(X7<(-3+((Z8+Z9)/2)),\"NB\",\"OK\")))","v":"OK"},24]
["SD","Siste 30",null,{"$f":"STDEV(D$15:D$44)","v":0.5},{"$f":"D7+(2*D8)","v":30.75},33,null,{"$f":"STDEV(H$15:H$44)","v":0.5},{"$f":"H7+(2*H8)","v":26.75},29,null,{"$f":"STDEV(L$15:L$44)","v":0.5},{"$f":"L7+(2*L8)","v":24.75},27,null,{"$f":"STDEV(P$15:P$44)","v":2.2173557826083452},{"$f":"P7+(2*P8)","v":32.684711565216688},33,null,{"$f":"STDEV(T$15:T$44)","v":0},{"$f":"T7+(2*T8)","v":23},26,null,{"$f":"STDEV(X$15:X$44)","v":0},{"$f":"X7+(2*X8)","v":23},28]
["CV%",null,null,{"$f":"D8/D7","v":1.680672268907563E-2},{"$f":"D7-(2*D8)","v":28.75},25,null,{"$f":"H8/H7","v":1.9417475728155338E-2},{"$f":"H7-(2*H8)","v":24.75},23,null,{"$f":"L8/L7","v":2.1052631578947368E-2},{"$f":"L7-(2*L8)","v":22.75},21,null,{"$f":"P8/P7","v":7.8490470180826374E-2},{"$f":"P7-(2*P8)","v":23.815288434783309},27,null,{"$f":"T8/T7","v":0},{"$f":"T7-(2*T8)","v":23},20,null,{"$f":"X8/X7","v":0},{"$f":"X7-(2*X8)","v":23},20]
[]
[]
[]
[]
[null,null,"Initialer, Avvik, Komm.",null,"Avvik","s30","RT",null,"Avvik","s30","RT",null,"Avvik","s30","RT",null,"Avvik","s30","RT",null,"Avvik","s30","RT",null,"Avvik","s30","RT"]
["2019-09-25",1,null,30,{"$f":"(D15-$D$7)/$D$7","v":8.4033613445378148E-3},{"$f":"IF((ABS(E15)>($D$9*3)),\"AV\",IF((ABS(E15)>($D$9*2)),\"NB\",\"\"))","v":""},"",26,{"$f":"(H15-$H$7)/$H$7","v":9.7087378640776691E-3},{"$f":"IF((ABS(I15)>($H$9*3)),\"AV\",IF((ABS(I15)>($H$9*2)),\"NB\",\"\"))","v":""},"",24,{"$f":"(L15-$L$7)/$L$7","v":1.0526315789473684E-2},{"$f":"IF((ABS(M15)>($L$9*3)),\"AV\",IF((ABS(M15)>($L$9*2)),\"NB\",\"\"))","v":""},"",29,{"$f":"(P15-$P$7)/$P$7","v":2.6548672566371681E-2},{"$f":"IF((ABS(Q15)>($P$9*3)),\"AV\",IF((ABS(Q15)>($P$9*2)),\"NB\",\"\"))","v":""},"",23,{"$f":"(T15-$T$7)/$T$7","v":0},{"$f":"IF((ABS(U15)>($T$9*3)),\"AV\",IF((ABS(U15)>($T$9*2)),\"NB\",\"\"))","v":""},"",23,{"$f":"(X15-$X$7)/$X$7","v":0},{"$f":"IF((ABS(Y15)>($X$9*3)),\"AV\",IF((ABS(Y15)>($X$9*2)),\"NB\",\"\"))","v":""},"",null,null,null,null,null,null,null,null,null,null,null,{"$f":"F$8","v":33},{"$f":"F$9","v":25},{"$f":"J$8","v":29},{"$f":"J$9","v":23},{"$f":"N$8","v":27},{"$f":"N$9","v":21},{"$f":"R$8","v":33},{"$f":"R$9","v":27},{"$f":"V$8","v":26},{"$f":"V$9","v":20},{"$f":"Z$8","v":28},{"$f":"Z$9","v":20}]
["2019-09-18",{"$f":"1+B15","v":2},null,30,{"$f":"(D16-$D$7)/$D$7","v":8.4033613445378148E-3},{"$f":"IF((ABS(E16)>($D$9*3)),\"AV\",IF((ABS(E16)>($D$9*2)),\"NB\",\"\"))","v":""},"",26,{"$f":"(H16-$H$7)/$H$7","v":9.7087378640776691E-3},{"$f":"IF((ABS(I16)>($H$9*3)),\"AV\",IF((ABS(I16)>($H$9*2)),\"NB\",\"\"))","v":""},"",24,{"$f":"(L16-$L$7)/$L$7","v":1.0526315789473684E-2},{"$f":"IF((ABS(M16)>($L$9*3)),\"AV\",IF((ABS(M16)>($L$9*2)),\"NB\",\"\"))","v":""},"",25,{"$f":"(P16-$P$7)/$P$7","v":-0.11504424778761062},{"$f":"IF((ABS(Q16)>($P$9*3)),\"AV\",IF((ABS(Q16)>($P$9*2)),\"NB\",\"\"))","v":""},null,23,{"$f":"(T16-$T$7)/$T$7","v":0},{"$f":"IF((ABS(U16)>($T$9*3)),\"AV\",IF((ABS(U16)>($T$9*2)),\"NB\",\"\"))","v":""},"",23,{"$f":"(X16-$X$7)/$X$7","v":0},{"$f":"IF((ABS(Y16)>($X$9*3)),\"AV\",IF((ABS(Y16)>($X$9*2)),\"NB\",\"\"))","v":""},"",null,null,null,null,null,null,null,null,null,null,null,{"$f":"F$8","v":33},{"$f":"F$9","v":25},{"$f":"J$8","v":29},{"$f":"J$9","v":23},{"$f":"N$8","v":27},{"$f":"N$9","v":21},{"$f":"R$8","v":33},{"$f":"R$9","v":27},{"$f":"V$8","v":26},{"$f":"V$9","v":20},{"$f":"Z$8","v":28},{"$f":"Z$9","v":20}]
["2019-09-11",3,null,30,{"$f":"(D17-$D$7)/$D$7","v":8.4033613445378148E-3},{"$f":"IF((ABS(E17)>($D$9*3)),\"AV\",IF((ABS(E17)>($D$9*2)),\"NB\",\"\"))","v":""},"",26,{"$f":"(H17-$H$7)/$H$7","v":9.7087378640776691E-3},{"$f":"IF((ABS(I17)>($H$9*3)),\"AV\",IF((ABS(I17)>($H$9*2)),\"NB\",\"\"))","v":""},"",24,{"$f":"(L17-$L$7)/$L$7","v":1.0526315789473684E-2},{"$f":"IF((ABS(M17)>($L$9*3)),\"AV\",IF((ABS(M17)>($L$9*2)),\"NB\",\"\"))","v":""},"",29,{"$f":"(P17-$P$7)/$P$7","v":2.6548672566371681E-2},{"$f":"IF((ABS(Q17)>($P$9*3)),\"AV\",IF((ABS(Q17)>($P$9*2)),\"NB\",\"\"))","v":""},"",23,{"$f":"(T17-$T$7)/$T$7","v":0},{"$f":"IF((ABS(U17)>($T$9*3)),\"AV\",IF((ABS(U17)>($T$9*2)),\"NB\",\"\"))","v":""},"",23,{"$f":"(X17-$X$7)/$X$7","v":0},{"$f":"IF((ABS(Y17)>($X$9*3)),\"AV\",IF((ABS(Y17)>($X$9*2)),\"NB\",\"\"))","v":""},"",null,null,null,null,null,null,null,null,null,null,null,{"$f":"F$8","v":33},{"$f":"F$9","v":25},{"$f":"J$8","v":29},{"$f":"J$9","v":23},{"$f":"N$8","v":27},{"$f":"N$9","v":21},{"$f":"R$8","v":33},{"$f":"R$9","v":27},{"$f":"V$8","v":26},{"$f":"V$9","v":20},{"$f":"Z$8","v":28},{"$f":"Z$9","v":20}]
["2019-09-04",4,null,29,{"$f":"(D18-$D$7)/$D$7","v":-2.5210084033613446E-2},{"$f":"IF((ABS(E18)>($D$9*3)),\"AV\",IF((ABS(E18)>($D$9*2)),\"NB\",\"\"))","v":""},"",25,{"$f":"(H18-$H$7)/$H$7","v":-2.9126213592233011E-2},{"$f":"IF((ABS(I18)>($H$9*3)),\"AV\",IF((ABS(I18)>($H$9*2)),\"NB\",\"\"))","v":""},"",23,{"$f":"(L18-$L$7)/$L$7","v":-3.1578947368421054E-2},{"$f":"IF((ABS(M18)>($L$9*3)),\"AV\",IF((ABS(M18)>($L$9*2)),\"NB\",\"\"))","v":""},"",30,{"$f":"(P18-$P$7)/$P$7","v":6.1946902654867256E-2},{"$f":"IF((ABS(Q18)>($P$9*3)),\"AV\",IF((ABS(Q18)>($P$9*2)),\"NB\",\"\"))","v":""},"",23,{"$f":"(T18-$T$7)/$T$7","v":0},{"$f":"IF((ABS(U18)>($T$9*3)),\"AV\",IF((ABS(U18)>($T$9*2)),\"NB\",\"\"))","v":""},"",23,{"$f":"(X18-$X$7)/$X$7","v":0},{"$f":"IF((ABS(Y18)>($X$9*3)),\"AV\",IF((ABS(Y18)>($X$9*2)),\"NB\",\"\"))","v":""},"",null,null,null,null,null,null,null,null,null,null,null,{"$f":"F$8","v":33},{"$f":"F$9","v":25},{"$f":"J$8","v":29},{"$f":"J$9","v":23},{"$f":"N$8","v":27},{"$f":"N$9","v":21},{"$f":"R$8","v":33},{"$f":"R$9","v":27},{"$f":"V$8","v":26},{"$f":"V$9","v":20},{"$f":"Z$8","v":28},{"$f":"Z$9","v":20}]
[null,null,null,null,null,null,null,null,null,null,null,null,null,null,null,null,null,null,null,null,null,null,null,null,null,null,null,null,null,null,null,null,null,null,null,null,null,null,{"$f":"F$8","v":33},{"$f":"F$9","v":25},{"$f":"J$8","v":29},{"$f":"J$9","v":23},{"$f":"N$8","v":27},{"$f":"N$9","v":21},{"$f":"R$8","v":33},{"$f":"R$9","v":27},{"$f":"V$8","v":26},{"$f":"V$9","v":20},{"$f":"Z$8","v":28},{"$f":"Z$9","v":20}]
[null,null,null,null,null,null,null,null,null,null,null,null,null,null,null,null,null,null,null,null,null,null,null,null,null,null,null,null,null,null,null,null,null,null,null,null,null,null,{"$f":"F$8","v":33},{"$f":"F$9","v":25},{"$f":"J$8","v":29},{"$f":"J$9","v":23},{"$f":"N$8","v":27},{"$f":"N$9","v":21},{"$f":"R$8","v":33},{"$f":"R$9","v":27},{"$f":"V$8","v":26},{"$f":"V$9","v":20},{"$f":"Z$8","v":28},{"$f":"Z$9","v":20}]
[null,null,null,null,null,null,null,null,null,null,null,null,null,null,null,null,null,null,null,null,null,null,null,null,null,null,null,null,null,null,null,null,null,null,null,null,null,null,{"$f":"F$8","v":33},{"$f":"F$9","v":25},{"$f":"J$8","v":29},{"$f":"J$9","v":23},{"$f":"N$8","v":27},{"$f":"N$9","v":21},{"$f":"R$8","v":33},{"$f":"R$9","v":27},{"$f":"V$8","v":26},{"$f":"V$9","v":20},{"$f":"Z$8","v":28},{"$f":"Z$9","v":20}]
[null,null,null,null,null,null,null,null,null,null,null,null,null,null,null,null,null,null,null,null,null,null,null,null,null,null,null,null,null,null,null,null,null,null,null,null,null,null,{"$f":"F$8","v":33},{"$f":"F$9","v":25},{"$f":"J$8","v":29},{"$f":"J$9","v":23},{"$f":"N$8","v":27},{"$f":"N$9","v":21},{"$f":"R$8","v":33},{"$f":"R$9","v":27},{"$f":"V$8","v":26},{"$f":"V$9","v":20},{"$f":"Z$8","v":28},{"$f":"Z$9","v":20}]
[null,null,null,null,null,null,null,null,null,null,null,null,null,null,null,null,null,null,null,null,null,null,null,null,null,null,null,null,null,null,null,null,null,null,null,null,null,null,{"$f":"F$8","v":33},{"$f":"F$9","v":25},{"$f":"J$8","v":29},{"$f":"J$9","v":23},{"$f":"N$8","v":27},{"$f":"N$9","v":21},{"$f":"R$8","v":33},{"$f":"R$9","v":27},{"$f":"V$8","v":26},{"$f":"V$9","v":20},{"$f":"Z$8","v":28},{"$f":"Z$9","v":20}]
[null,null,null,null,null,null,null,null,null,null,null,null,null,null,null,null,null,null,null,null,null,null,null,null,null,null,null,null,null,null,null,null,null,null,null,null,null,null,{"$f":"F$8","v":33},{"$f":"F$9","v":25},{"$f":"J$8","v":29},{"$f":"J$9","v":23},{"$f":"N$8","v":27},{"$f":"N$9","v":21},{"$f":"R$8","v":33},{"$f":"R$9","v":27},{"$f":"V$8","v":26},{"$f":"V$9","v":20},{"$f":"Z$8","v":28},{"$f":"Z$9","v":20}]
[null,null,null,null,null,null,null,null,null,null,null,null,null,null,null,null,null,null,null,null,null,null,null,null,null,null,null,null,null,null,null,null,null,null,null,null,null,null,{"$f":"F$8","v":33},{"$f":"F$9","v":25},{"$f":"J$8","v":29},{"$f":"J$9","v":23},{"$f":"N$8","v":27},{"$f":"N$9","v":21},{"$f":"R$8","v":33},{"$f":"R$9","v":27},{"$f":"V$8","v":26},{"$f":"V$9","v":20},{"$f":"Z$8","v":28},{"$f":"Z$9","v":20}]
[null,null,null,null,null,null,null,null,null,null,null,null,null,null,null,null,null,null,null,null,null,null,null,null,null,null,null,null,null,null,null,null,null,null,null,null,null,null,{"$f":"F$8","v":33},{"$f":"F$9","v":25},{"$f":"J$8","v":29},{"$f":"J$9","v":23},{"$f":"N$8","v":27},{"$f":"N$9","v":21},{"$f":"R$8","v":33},{"$f":"R$9","v":27},{"$f":"V$8","v":26},{"$f":"V$9","v":20},{"$f":"Z$8","v":28},{"$f":"Z$9","v":20}]
[null,null,null,null,null,null,null,null,null,null,null,null,null,null,null,null,null,null,null,null,null,null,null,null,null,null,null,null,null,null,null,null,null,null,null,null,null,null,{"$f":"F$8","v":33},{"$f":"F$9","v":25},{"$f":"J$8","v":29},{"$f":"J$9","v":23},{"$f":"N$8","v":27},{"$f":"N$9","v":21},{"$f":"R$8","v":33},{"$f":"R$9","v":27},{"$f":"V$8","v":26},{"$f":"V$9","v":20},{"$f":"Z$8","v":28},{"$f":"Z$9","v":20}]
[null,null,null,null,null,null,null,null,null,null,null,null,null,null,null,null,null,null,null,null,null,null,null,null,null,null,null,null,null,null,null,null,null,null,null,null,null,null,{"$f":"F$8","v":33},{"$f":"F$9","v":25},{"$f":"J$8","v":29},{"$f":"J$9","v":23},{"$f":"N$8","v":27},{"$f":"N$9","v":21},{"$f":"R$8","v":33},{"$f":"R$9","v":27},{"$f":"V$8","v":26},{"$f":"V$9","v":20},{"$f":"Z$8","v":28},{"$f":"Z$9","v":20}]
[null,null,null,null,null,null,null,null,null,null,null,null,null,null,null,null,null,null,null,null,null,null,null,null,null,null,null,null,null,null,null,null,null,null,null,null,null,null,{"$f":"F$8","v":33},{"$f":"F$9","v":25},{"$f":"J$8","v":29},{"$f":"J$9","v":23},{"$f":"N$8","v":27},{"$f":"N$9","v":21},{"$f":"R$8","v":33},{"$f":"R$9","v":27},{"$f":"V$8","v":26},{"$f":"V$9","v":20},{"$f":"Z$8","v":28},{"$f":"Z$9","v":20}]
[null,null,null,null,null,null,null,null,null,null,null,null,null,null,null,null,null,null,null,null,null,null,null,null,null,null,null,null,null,null,null,null,null,null,null,null,null,null,{"$f":"F$8","v":33},{"$f":"F$9","v":25},{"$f":"J$8","v":29},{"$f":"J$9","v":23},{"$f":"N$8","v":27},{"$f":"N$9","v":21},{"$f":"R$8","v":33},{"$f":"R$9","v":27},{"$f":"V$8","v":26},{"$f":"V$9","v":20},{"$f":"Z$8","v":28},{"$f":"Z$9","v":20}]
[null,null,null,null,null,null,null,null,null,null,null,null,null,null,null,null,null,null,null,null,null,null,null,null,null,null,null,null,null,null,null,null,null,null,null,null,null,null,{"$f":"F$8","v":33},{"$f":"F$9","v":25},{"$f":"J$8","v":29},{"$f":"J$9","v":23},{"$f":"N$8","v":27},{"$f":"N$9","v":21},{"$f":"R$8","v":33},{"$f":"R$9","v":27},{"$f":"V$8","v":26},{"$f":"V$9","v":20},{"$f":"Z$8","v":28},{"$f":"Z$9","v":20}]
[null,null,null,null,null,null,null,null,null,null,null,null,null,null,null,null,null,null,null,null,null,null,null,null,null,null,null,null,null,null,null,null,null,null,null,null,null,null,{"$f":"F$8","v":33},{"$f":"F$9","v":25},{"$f":"J$8","v":29},{"$f":"J$9","v":23},{"$f":"N$8","v":27},{"$f":"N$9","v":21},{"$f":"R$8","v":33},{"$f":"R$9","v":27},{"$f":"V$8","v":26},{"$f":"V$9","v":20},{"$f":"Z$8","v":28},{"$f":"Z$9","v":20}]
[null,null,null,null,null,null,null,null,null,null,null,null,null,null,null,null,null,null,null,null,null,null,null,null,null,null,null,null,null,null,null,null,null,null,null,null,null,null,{"$f":"F$8","v":33},{"$f":"F$9","v":25},{"$f":"J$8","v":29},{"$f":"J$9","v":23},{"$f":"N$8","v":27},{"$f":"N$9","v":21},{"$f":"R$8","v":33},{"$f":"R$9","v":27},{"$f":"V$8","v":26},{"$f":"V$9","v":20},{"$f":"Z$8","v":28},{"$f":"Z$9","v":20}]
[null,null,null,null,null,null,null,null,null,null,null,null,null,null,null,null,null,null,null,null,null,null,null,null,null,null,null,null,null,null,null,null,null,null,null,null,null,null,{"$f":"F$8","v":33},{"$f":"F$9","v":25},{"$f":"J$8","v":29},{"$f":"J$9","v":23},{"$f":"N$8","v":27},{"$f":"N$9","v":21},{"$f":"R$8","v":33},{"$f":"R$9","v":27},{"$f":"V$8","v":26},{"$f":"V$9","v":20},{"$f":"Z$8","v":28},{"$f":"Z$9","v":20}]
[null,null,null,null,null,null,null,null,null,null,null,null,null,null,null,null,null,null,null,null,null,null,null,null,null,null,null,null,null,null,null,null,null,null,null,null,null,null,{"$f":"F$8","v":33},{"$f":"F$9","v":25},{"$f":"J$8","v":29},{"$f":"J$9","v":23},{"$f":"N$8","v":27},{"$f":"N$9","v":21},{"$f":"R$8","v":33},{"$f":"R$9","v":27},{"$f":"V$8","v":26},{"$f":"V$9","v":20},{"$f":"Z$8","v":28},{"$f":"Z$9","v":20}]
[null,null,null,null,null,null,null,null,null,null,null,null,null,null,null,null,null,null,null,null,null,null,null,null,null,null,null,null,null,null,null,null,null,null,null,null,null,null,{"$f":"F$8","v":33},{"$f":"F$9","v":25},{"$f":"J$8","v":29},{"$f":"J$9","v":23},{"$f":"N$8","v":27},{"$f":"N$9","v":21},{"$f":"R$8","v":33},{"$f":"R$9","v":27},{"$f":"V$8","v":26},{"$f":"V$9","v":20},{"$f":"Z$8","v":28},{"$f":"Z$9","v":20}]
[null,null,null,null,null,null,null,null,null,null,null,null,null,null,null,null,null,null,null,null,null,null,null,null,null,null,null,null,null,null,null,null,null,null,null,null,null,null,{"$f":"F$8","v":33},{"$f":"F$9","v":25},{"$f":"J$8","v":29},{"$f":"J$9","v":23},{"$f":"N$8","v":27},{"$f":"N$9","v":21},{"$f":"R$8","v":33},{"$f":"R$9","v":27},{"$f":"V$8","v":26},{"$f":"V$9","v":20},{"$f":"Z$8","v":28},{"$f":"Z$9","v":20}]
[null,null,null,null,null,null,null,null,null,null,null,null,null,null,null,null,null,null,null,null,null,null,null,null,null,null,null,null,null,null,null,null,null,null,null,null,null,null,{"$f":"F$8","v":33},{"$f":"F$9","v":25},{"$f":"J$8","v":29},{"$f":"J$9","v":23},{"$f":"N$8","v":27},{"$f":"N$9","v":21},{"$f":"R$8","v":33},{"$f":"R$9","v":27},{"$f":"V$8","v":26},{"$f":"V$9","v":20},{"$f":"Z$8","v":28},{"$f":"Z$9","v":20}]
[null,null,null,null,null,null,null,null,null,null,null,null,null,null,null,null,null,null,null,null,null,null,null,null,null,null,null,null,null,null,null,null,null,null,null,null,null,null,{"$f":"F$8","v":33},{"$f":"F$9","v":25},{"$f":"J$8","v":29},{"$f":"J$9","v":23},{"$f":"N$8","v":27},{"$f":"N$9","v":21},{"$f":"R$8","v":33},{"$f":"R$9","v":27},{"$f":"V$8","v":26},{"$f":"V$9","v":20},{"$f":"Z$8","v":28},{"$f":"Z$9","v":20}]
[null,null,null,null,null,null,null,null,null,null,null,null,null,null,null,null,null,null,null,null,null,null,null,null,null,null,null,null,null,null,null,null,null,null,null,null,null,null,{"$f":"F$8","v":33},{"$f":"F$9","v":25},{"$f":"J$8","v":29},{"$f":"J$9","v":23},{"$f":"N$8","v":27},{"$f":"N$9","v":21},{"$f":"R$8","v":33},{"$f":"R$9","v":27},{"$f":"V$8","v":26},{"$f":"V$9","v":20},{"$f":"Z$8","v":28},{"$f":"Z$9","v":20}]
[null,null,null,null,null,null,null,null,null,null,null,null,null,null,null,null,null,null,null,null,null,null,null,null,null,null,null,null,null,null,null,null,null,null,null,null,null,null,{"$f":"F$8","v":33},{"$f":"F$9","v":25},{"$f":"J$8","v":29},{"$f":"J$9","v":23},{"$f":"N$8","v":27},{"$f":"N$9","v":21},{"$f":"R$8","v":33},{"$f":"R$9","v":27},{"$f":"V$8","v":26},{"$f":"V$9","v":20},{"$f":"Z$8","v":28},{"$f":"Z$9","v":20}]
[null,null,null,null,null,null,null,null,null,null,null,null,null,null,null,null,null,null,null,null,null,null,null,null,null,null,null,null,null,null,null,null,null,null,null,null,null,null,{"$f":"F$8","v":33},{"$f":"F$9","v":25},{"$f":"J$8","v":29},{"$f":"J$9","v":23},{"$f":"N$8","v":27},{"$f":"N$9","v":21},{"$f":"R$8","v":33},{"$f":"R$9","v":27},{"$f":"V$8","v":26},{"$f":"V$9","v":20},{"$f":"Z$8","v":28},{"$f":"Z$9","v":20}]
[null,null,null,null,null,null,null,null,null,null,null,null,null,null,null,null,null,null,null,null,null,null,null,null,null,null,null,null,null,null,null,null,null,null,null,null,null,null,{"$f":"F$8","v":33},{"$f":"F$9","v":25},{"$f":"J$8","v":29},{"$f":"J$9","v":23},{"$f":"N$8","v":27},{"$f":"N$9","v":21},{"$f":"R$8","v":33},{"$f":"R$9","v":27},{"$f":"V$8","v":26},{"$f":"V$9","v":20},{"$f":"Z$8","v":28},{"$f":"Z$9","v":20}]
[null,null,null,null,null,null,null,null,null,null,null,null,null,null,null,null,null,null,null,null,null,null,null,null,null,null,null,null,null,null,null,null,null,null,null,null,null,null,{"$f":"F$8","v":33},{"$f":"F$9","v":25},{"$f":"J$8","v":29},{"$f":"J$9","v":23},{"$f":"N$8","v":27},{"$f":"N$9","v":21},{"$f":"R$8","v":33},{"$f":"R$9","v":27},{"$f":"V$8","v":26},{"$f":"V$9","v":20},{"$f":"Z$8","v":28},{"$f":"Z$9","v":20}]

{"sheet":"STREP","index":4,"n_rows":44,"n_cols":48,"rows_kept":44,"cut":false,"hidden":false,"merged":[[4,46,4,47],[4,0,4,1],[4,3,4,22],[4,38,4,39],[4,40,4,41],[4,42,4,43],[4,44,4,45]]}
["Pneumokokker (STREP)"]
["2019-10-01",null,null,"PA Jenum"]
["Registrér etter at måleverdiene er lagt inn"]
[]
["Ukentlig",null,null,"Streptococcus pneumoniae  ATCC 49619",null,null,null,null,null,null,null,null,null,null,null,null,null,null,null,null,null,null,null,null,null,null,null,null,null,null,null,null,null,null,null,null,null,null,{"$f":"E6","v":"E       15"},null,{"$f":"I6","v":"DA       2"},null,{"$f":"M6","v":"SXT 25"},null,{"$f":"Q6","v":"TE       30"},null,{"$f":"U6","v":"OX       1"}]
["Dato","Nr",null,"Erytromycin 15","E       15","Sonegrenser","Target","Clindamycin 2","DA       2","Sonegrenser","Target","Trimetoprim-sulfa","SXT 25","Sonegrenser","Target","Tetracyklin 30","TE       30","Sonegrenser","Target","Oxacillin 1","OX       1","Sonegrenser","Target",null,null,null,null,null,null,null,null,null,null,null,null,null,null,null,"Øvre","Nedre","Øvre","Nedre","Øvre","Nedre","Øvre","Nedre","Øvre","Nedre"]
["Snitt","Siste 30",null,{"$f":"AVERAGE(D$15:D$44)","v":27},"+-2SD",{"$f":"IF(F8=\"\",\"\",IF(D7>(3+((F8+F9)/2)),\"NB\",IF(D7<(-3+((F8+F9)/2)),\"NB\",\"OK\")))","v":"OK"},29,{"$f":"AVERAGE(H$15:H$44)","v":23.5},"+-2SD",{"$f":"IF(J8=\"\",\"\",IF(H7>(3+((J8+J9)/2)),\"NB\",IF(H7<(-3+((J8+J9)/2)),\"NB\",\"OK\")))","v":"OK"},25,{"$f":"AVERAGE(L$15:L$44)","v":23.25},"+-2SD",{"$f":"IF(N8=\"\",\"\",IF(L7>(3+((N8+N9)/2)),\"NB\",IF(L7<(-3+((N8+N9)/2)),\"NB\",\"OK\")))","v":"OK"},22,{"$f":"AVERAGE(P$15:P$44)","v":29.5},"+-2SD",{"$f":"IF(R8=\"\",\"\",IF(P7>(3+((R8+R9)/2)),\"NB\",IF(P7<(-3+((R8+R9)/2)),\"NB\",\"OK\")))","v":"OK"},31,{"$f":"AVERAGE(T$15:T$44)","v":11.5},"+-2SD",{"$f":"IF(V8=\"\",\"\",IF(T7>(3+((V8+V9)/2)),\"NB\",IF(T7<(-3+((V8+V9)/2)),\"NB\",\"OK\")))","v":"OK"},11]
["SD","Siste 30",null,{"$f":"STDEV(D$15:D$44)","v":0.81649658092772603},{"$f":"D7+(2*D8)","v":28.632993161855453},32,null,{"$f":"STDEV(H$15:H$44)","v":0.57735026918962573},{"$f":"H7+(2*H8)","v":24.654700538379252},28,null,{"$f":"STDEV(L$15:L$44)","v":0.9574271077563381},{"$f":"L7+(2*L8)","v":25.164854215512676},26,null,{"$f":"STDEV(P$15:P$44)","v":0.57735026918962573},{"$f":"P7+(2*P8)","v":30.654700538379252},34,null,{"$f":"STDEV(T$15:T$44)","v":0.57735026918962573},{"$f":"T7+(2*T8)","v":12.654700538379252},14]
["CV%",null,null,{"$f":"D8/D7","v":3.0240614108434299E-2},{"$f":"D7-(2*D8)","v":25.367006838144547},26,null,{"$f":"H8/H7","v":2.4568096561260671E-2},{"$f":"H7-(2*H8)","v":22.345299461620748},22,null,{"$f":"L8/L7","v":4.1179660548659701E-2},{"$f":"L7-(2*L8)","v":21.335145784487324},18,null,{"$f":"P8/P7","v":1.9571195565750026E-2},{"$f":"P7-(2*P8)","v":28.345299461620748},28,null,{"$f":"T8/T7","v":5.0204371233880496E-2},{"$f":"T7-(2*T8)","v":10.345299461620748},8]
[]
[]
["Legg inn diameter i hele millimeter i fargede felt i Rad 13"]
[]
[null,null,"Initialer, Avvik, Komm.",null,"Avvik","s30","RT",null,"Avvik","s30","RT",null,"Avvik","s30","RT",null,"Avvik","s30","RT",null,"Avvik","s30","RT"]
["2019-09-25",1,null,28,{"$f":"(D15-$D$7)/$D$7","v":3.7037037037037035E-2},{"$f":"IF((ABS(E15)>($D$9*3)),\"AV\",IF((ABS(E15)>($D$9*2)),\"NB\",\"\"))","v":""},"",24,{"$f":"(H15-$H$7)/$H$7","v":2.1276595744680851E-2},{"$f":"IF((ABS(I15)>($H$9*3)),\"AV\",IF((ABS(I15)>($H$9*2)),\"NB\",\"\"))","v":""},"",24,{"$f":"(L15-$L$7)/$L$7","v":3.2258064516129031E-2},{"$f":"IF((ABS(M15)>($L$9*3)),\"AV\",IF((ABS(M15)>($L$9*2)),\"NB\",\"\"))","v":""},"",30,{"$f":"(P15-$P$7)/$P$7","v":1.6949152542372881E-2},{"$f":"IF((ABS(Q15)>($P$9*3)),\"AV\",IF((ABS(Q15)>($P$9*2)),\"NB\",\"\"))","v":""},"",11,{"$f":"IF(T15=0,\"\",((T15-$T$7)/$T$7))","v":-4.3478260869565216E-2},{"$f":"IF(U15=\"\",\"\",(IF((ABS(U15)>($T$9*3)),\"AV\",IF((ABS(U15)>($T$9*2)),\"NB\",\"\"))))","v":""},"",null,null,null,null,null,null,null,null,null,null,null,null,null,null,null,{"$f":"F$8","v":32},{"$f":"F$9","v":26},{"$f":"J$8","v":28},{"$f":"J$9","v":22},{"$f":"N$8","v":26},{"$f":"N$9","v":18},{"$f":"R$8","v":34},{"$f":"R$9","v":28},{"$f":"V$8","v":14},{"$f":"V$9","v":8}]
["2019-09-19",{"$f":"B15+1","v":2},null,27,{"$f":"(D16-$D$7)/$D$7","v":0},{"$f":"IF((ABS(E16)>($D$9*3)),\"AV\",IF((ABS(E16)>($D$9*2)),\"NB\",\"\"))","v":""},"",23,{"$f":"(H16-$H$7)/$H$7","v":-2.1276595744680851E-2},{"$f":"IF((ABS(I16)>($H$9*3)),\"AV\",IF((ABS(I16)>($H$9*2)),\"NB\",\"\"))","v":""},"",24,{"$f":"(L16-$L$7)/$L$7","v":3.2258064516129031E-2},{"$f":"IF((ABS(M16)>($L$9*3)),\"AV\",IF((ABS(M16)>($L$9*2)),\"NB\",\"\"))","v":""},"",29,{"$f":"(P16-$P$7)/$P$7","v":-1.6949152542372881E-2},{"$f":"IF((ABS(Q16)>($P$9*3)),\"AV\",IF((ABS(Q16)>($P$9*2)),\"NB\",\"\"))","v":""},"",11,{"$f":"IF(T16=0,\"\",((T16-$T$7)/$T$7))","v":-4.3478260869565216E-2},{"$f":"IF(U16=\"\",\"\",(IF((ABS(U16)>($T$9*3)),\"AV\",IF((ABS(U16)>($T$9*2)),\"NB\",\"\"))))","v":""},"",null,null,null,null,null,null,null,null,null,null,null,null,null,null,null,{"$f":"F$8","v":32},{"$f":"F$9","v":26},{"$f":"J$8","v":28},{"$f":"J$9","v":22},{"$f":"N$8","v":26},{"$f":"N$9","v":18},{"$f":"R$8","v":34},{"$f":"R$9","v":28},{"$f":"V$8","v":14},{"$f":"V$9","v":8}]
["2019-09-04",3,null,27,{"$f":"(D17-$D$7)/$D$7","v":0},{"$f":"IF((ABS(E17)>($D$9*3)),\"AV\",IF((ABS(E17)>($D$9*2)),\"NB\",\"\"))","v":""},"",24,{"$f":"(H17-$H$7)/$H$7","v":2.1276595744680851E-2},{"$f":"IF((ABS(I17)>($H$9*3)),\"AV\",IF((ABS(I17)>($H$9*2)),\"NB\",\"\"))","v":""},"",23,{"$f":"(L17-$L$7)/$L$7","v":-1.0752688172043012E-2},{"$f":"IF((ABS(M17)>($L$9*3)),\"AV\",IF((ABS(M17)>($L$9*2)),\"NB\",\"\"))","v":""},"",30,{"$f":"(P17-$P$7)/$P$7","v":1.6949152542372881E-2},{"$f":"IF((ABS(Q17)>($P$9*3)),\"AV\",IF((ABS(Q17)>($P$9*2)),\"NB\",\"\"))","v":""},"",12,{"$f":"IF(T17=0,\"\",((T17-$T$7)/$T$7))","v":4.3478260869565216E-2},{"$f":"IF(U17=\"\",\"\",(IF((ABS(U17)>($T$9*3)),\"AV\",IF((ABS(U17)>($T$9*2)),\"NB\",\"\"))))","v":""},"",null,null,null,null,null,null,null,null,null,null,null,null,null,null,null,{"$f":"F$8","v":32},{"$f":"F$9","v":26},{"$f":"J$8","v":28},{"$f":"J$9","v":22},{"$f":"N$8","v":26},{"$f":"N$9","v":18},{"$f":"R$8","v":34},{"$f":"R$9","v":28},{"$f":"V$8","v":14},{"$f":"V$9","v":8}]
["2019-08-28",4,null,26,{"$f":"(D18-$D$7)/$D$7","v":-3.7037037037037035E-2},{"$f":"IF((ABS(E18)>($D$9*3)),\"AV\",IF((ABS(E18)>($D$9*2)),\"NB\",\"\"))","v":""},"",23,{"$f":"(H18-$H$7)/$H$7","v":-2.1276595744680851E-2},{"$f":"IF((ABS(I18)>($H$9*3)),\"AV\",IF((ABS(I18)>($H$9*2)),\"NB\",\"\"))","v":""},"",22,{"$f":"(L18-$L$7)/$L$7","v":-5.3763440860215055E-2},{"$f":"IF((ABS(M18)>($L$9*3)),\"AV\",IF((ABS(M18)>($L$9*2)),\"NB\",\"\"))","v":""},"",29,{"$f":"(P18-$P$7)/$P$7","v":-1.6949152542372881E-2},{"$f":"IF((ABS(Q18)>($P$9*3)),\"AV\",IF((ABS(Q18)>($P$9*2)),\"NB\",\"\"))","v":""},"",12,{"$f":"IF(T18=0,\"\",((T18-$T$7)/$T$7))","v":4.3478260869565216E-2},{"$f":"IF(U18=\"\",\"\",(IF((ABS(U18)>($T$9*3)),\"AV\",IF((ABS(U18)>($T$9*2)),\"NB\",\"\"))))","v":""},"",null,null,null,null,null,null,null,null,null,null,null,null,null,null,null,{"$f":"F$8","v":32},{"$f":"F$9","v":26},{"$f":"J$8","v":28},{"$f":"J$9","v":22},{"$f":"N$8","v":26},{"$f":"N$9","v":18},{"$f":"R$8","v":34},{"$f":"R$9","v":28},{"$f":"V$8","v":14},{"$f":"V$9","v":8}]
[null,null,null,null,null,null,null,null,null,null,null,null,null,null,null,null,null,null,null,null,null,null,null,null,null,null,null,null,null,null,null,null,null,null,null,null,null,null,{"$f":"F$8","v":32},{"$f":"F$9","v":26},{"$f":"J$8","v":28},{"$f":"J$9","v":22},{"$f":"N$8","v":26},{"$f":"N$9","v":18},{"$f":"R$8","v":34},{"$f":"R$9","v":28},{"$f":"V$8","v":14},{"$f":"V$9","v":8}]
[null,null,null,null,null,null,null,null,null,null,null,null,null,null,null,null,null,null,null,null,null,null,null,null,null,null,null,null,null,null,null,null,null,null,null,null,null,null,{"$f":"F$8","v":32},{"$f":"F$9","v":26},{"$f":"J$8","v":28},{"$f":"J$9","v":22},{"$f":"N$8","v":26},{"$f":"N$9","v":18},{"$f":"R$8","v":34},{"$f":"R$9","v":28},{"$f":"V$8","v":14},{"$f":"V$9","v":8}]
[null,null,null,null,null,null,null,null,null,null,null,null,null,null,null,null,null,null,null,null,null,null,null,null,null,null,null,null,null,null,null,null,null,null,null,null,null,null,{"$f":"F$8","v":32},{"$f":"F$9","v":26},{"$f":"J$8","v":28},{"$f":"J$9","v":22},{"$f":"N$8","v":26},{"$f":"N$9","v":18},{"$f":"R$8","v":34},{"$f":"R$9","v":28},{"$f":"V$8","v":14},{"$f":"V$9","v":8}]
[null,null,null,null,null,null,null,null,null,null,null,null,null,null,null,null,null,null,null,null,null,null,null,null,null,null,null,null,null,null,null,null,null,null,null,null,null,null,{"$f":"F$8","v":32},{"$f":"F$9","v":26},{"$f":"J$8","v":28},{"$f":"J$9","v":22},{"$f":"N$8","v":26},{"$f":"N$9","v":18},{"$f":"R$8","v":34},{"$f":"R$9","v":28},{"$f":"V$8","v":14},{"$f":"V$9","v":8}]
[null,null,null,null,null,null,null,null,null,null,null,null,null,null,null,null,null,null,null,null,null,null,null,null,null,null,null,null,null,null,null,null,null,null,null,null,null,null,{"$f":"F$8","v":32},{"$f":"F$9","v":26},{"$f":"J$8","v":28},{"$f":"J$9","v":22},{"$f":"N$8","v":26},{"$f":"N$9","v":18},{"$f":"R$8","v":34},{"$f":"R$9","v":28},{"$f":"V$8","v":14},{"$f":"V$9","v":8}]
[null,null,null,null,null,null,null,null,null,null,null,null,null,null,null,null,null,null,null,null,null,null,null,null,null,null,null,null,null,null,null,null,null,null,null,null,null,null,{"$f":"F$8","v":32},{"$f":"F$9","v":26},{"$f":"J$8","v":28},{"$f":"J$9","v":22},{"$f":"N$8","v":26},{"$f":"N$9","v":18},{"$f":"R$8","v":34},{"$f":"R$9","v":28},{"$f":"V$8","v":14},{"$f":"V$9","v":8}]
[null,null,null,null,null,null,null,null,null,null,null,null,null,null,null,null,null,null,null,null,null,null,null,null,null,null,null,null,null,null,null,null,null,null,null,null,null,null,{"$f":"F$8","v":32},{"$f":"F$9","v":26},{"$f":"J$8","v":28},{"$f":"J$9","v":22},{"$f":"N$8","v":26},{"$f":"N$9","v":18},{"$f":"R$8","v":34},{"$f":"R$9","v":28},{"$f":"V$8","v":14},{"$f":"V$9","v":8}]
[null,null,null,null,null,null,null,null,null,null,null,null,null,null,null,null,null,null,null,null,null,null,null,null,null,null,null,null,null,null,null,null,null,null,null,null,null,null,{"$f":"F$8","v":32},{"$f":"F$9","v":26},{"$f":"J$8","v":28},{"$f":"J$9","v":22},{"$f":"N$8","v":26},{"$f":"N$9","v":18},{"$f":"R$8","v":34},{"$f":"R$9","v":28},{"$f":"V$8","v":14},{"$f":"V$9","v":8}]
[null,null,null,null,null,null,null,null,null,null,null,null,null,null,null,null,null,null,null,null,null,null,null,null,null,null,null,null,null,null,null,null,null,null,null,null,null,null,{"$f":"F$8","v":32},{"$f":"F$9","v":26},{"$f":"J$8","v":28},{"$f":"J$9","v":22},{"$f":"N$8","v":26},{"$f":"N$9","v":18},{"$f":"R$8","v":34},{"$f":"R$9","v":28},{"$f":"V$8","v":14},{"$f":"V$9","v":8}]
[null,null,null,null,null,null,null,null,null,null,null,null,null,null,null,null,null,null,null,null,null,null,null,null,null,null,null,null,null,null,null,null,null,null,null,null,null,null,{"$f":"F$8","v":32},{"$f":"F$9","v":26},{"$f":"J$8","v":28},{"$f":"J$9","v":22},{"$f":"N$8","v":26},{"$f":"N$9","v":18},{"$f":"R$8","v":34},{"$f":"R$9","v":28},{"$f":"V$8","v":14},{"$f":"V$9","v":8}]
[null,null,null,null,null,null,null,null,null,null,null,null,null,null,null,null,null,null,null,null,null,null,null,null,null,null,null,null,null,null,null,null,null,null,null,null,null,null,{"$f":"F$8","v":32},{"$f":"F$9","v":26},{"$f":"J$8","v":28},{"$f":"J$9","v":22},{"$f":"N$8","v":26},{"$f":"N$9","v":18},{"$f":"R$8","v":34},{"$f":"R$9","v":28},{"$f":"V$8","v":14},{"$f":"V$9","v":8}]
[null,null,null,null,null,null,null,null,null,null,null,null,null,null,null,null,null,null,null,null,null,null,null,null,null,null,null,null,null,null,null,null,null,null,null,null,null,null,{"$f":"F$8","v":32},{"$f":"F$9","v":26},{"$f":"J$8","v":28},{"$f":"J$9","v":22},{"$f":"N$8","v":26},{"$f":"N$9","v":18},{"$f":"R$8","v":34},{"$f":"R$9","v":28},{"$f":"V$8","v":14},{"$f":"V$9","v":8}]
[null,null,null,null,null,null,null,null,null,null,null,null,null,null,null,null,null,null,null,null,null,null,null,null,null,null,null,null,null,null,null,null,null,null,null,null,null,null,{"$f":"F$8","v":32},{"$f":"F$9","v":26},{"$f":"J$8","v":28},{"$f":"J$9","v":22},{"$f":"N$8","v":26},{"$f":"N$9","v":18},{"$f":"R$8","v":34},{"$f":"R$9","v":28},{"$f":"V$8","v":14},{"$f":"V$9","v":8}]
[null,null,null,null,null,null,null,null,null,null,null,null,null,null,null,null,null,null,null,null,null,null,null,null,null,null,null,null,null,null,null,null,null,null,null,null,null,null,{"$f":"F$8","v":32},{"$f":"F$9","v":26},{"$f":"J$8","v":28},{"$f":"J$9","v":22},{"$f":"N$8","v":26},{"$f":"N$9","v":18},{"$f":"R$8","v":34},{"$f":"R$9","v":28},{"$f":"V$8","v":14},{"$f":"V$9","v":8}]
[null,null,null,null,null,null,null,null,null,null,null,null,null,null,null,null,null,null,null,null,null,null,null,null,null,null,null,null,null,null,null,null,null,null,null,null,null,null,{"$f":"F$8","v":32},{"$f":"F$9","v":26},{"$f":"J$8","v":28},{"$f":"J$9","v":22},{"$f":"N$8","v":26},{"$f":"N$9","v":18},{"$f":"R$8","v":34},{"$f":"R$9","v":28},{"$f":"V$8","v":14},{"$f":"V$9","v":8}]
[null,null,null,null,null,null,null,null,null,null,null,null,null,null,null,null,null,null,null,null,null,null,null,null,null,null,null,null,null,null,null,null,null,null,null,null,null,null,{"$f":"F$8","v":32},{"$f":"F$9","v":26},{"$f":"J$8","v":28},{"$f":"J$9","v":22},{"$f":"N$8","v":26},{"$f":"N$9","v":18},{"$f":"R$8","v":34},{"$f":"R$9","v":28},{"$f":"V$8","v":14},{"$f":"V$9","v":8}]
[null,null,null,null,null,null,null,null,null,null,null,null,null,null,null,null,null,null,null,null,null,null,null,null,null,null,null,null,null,null,null,null,null,null,null,null,null,null,{"$f":"F$8","v":32},{"$f":"F$9","v":26},{"$f":"J$8","v":28},{"$f":"J$9","v":22},{"$f":"N$8","v":26},{"$f":"N$9","v":18},{"$f":"R$8","v":34},{"$f":"R$9","v":28},{"$f":"V$8","v":14},{"$f":"V$9","v":8}]
[null,null,null,null,null,null,null,null,null,null,null,null,null,null,null,null,null,null,null,null,null,null,null,null,null,null,null,null,null,null,null,null,null,null,null,null,null,null,{"$f":"F$8","v":32},{"$f":"F$9","v":26},{"$f":"J$8","v":28},{"$f":"J$9","v":22},{"$f":"N$8","v":26},{"$f":"N$9","v":18},{"$f":"R$8","v":34},{"$f":"R$9","v":28},{"$f":"V$8","v":14},{"$f":"V$9","v":8}]
[null,null,null,null,null,null,null,null,null,null,null,null,null,null,null,null,null,null,null,null,null,null,null,null,null,null,null,null,null,null,null,null,null,null,null,null,null,null,{"$f":"F$8","v":32},{"$f":"F$9","v":26},{"$f":"J$8","v":28},{"$f":"J$9","v":22},{"$f":"N$8","v":26},{"$f":"N$9","v":18},{"$f":"R$8","v":34},{"$f":"R$9","v":28},{"$f":"V$8","v":14},{"$f":"V$9","v":8}]
[null,null,null,null,null,null,null,null,null,null,null,null,null,null,null,null,null,null,null,null,null,null,null,null,null,null,null,null,null,null,null,null,null,null,null,null,null,null,{"$f":"F$8","v":32},{"$f":"F$9","v":26},{"$f":"J$8","v":28},{"$f":"J$9","v":22},{"$f":"N$8","v":26},{"$f":"N$9","v":18},{"$f":"R$8","v":34},{"$f":"R$9","v":28},{"$f":"V$8","v":14},{"$f":"V$9","v":8}]
[null,null,null,null,null,null,null,null,null,null,null,null,null,null,null,null,null,null,null,null,null,null,null,null,null,null,null,null,null,null,null,null,null,null,null,null,null,null,{"$f":"F$8","v":32},{"$f":"F$9","v":26},{"$f":"J$8","v":28},{"$f":"J$9","v":22},{"$f":"N$8","v":26},{"$f":"N$9","v":18},{"$f":"R$8","v":34},{"$f":"R$9","v":28},{"$f":"V$8","v":14},{"$f":"V$9","v":8}]
[null,null,null,null,null,null,null,null,null,null,null,null,null,null,null,null,null,null,null,null,null,null,null,null,null,null,null,null,null,null,null,null,null,null,null,null,null,null,{"$f":"F$8","v":32},{"$f":"F$9","v":26},{"$f":"J$8","v":28},{"$f":"J$9","v":22},{"$f":"N$8","v":26},{"$f":"N$9","v":18},{"$f":"R$8","v":34},{"$f":"R$9","v":28},{"$f":"V$8","v":14},{"$f":"V$9","v":8}]
[null,null,null,null,null,null,null,null,null,null,null,null,null,null,null,null,null,null,null,null,null,null,null,null,null,null,null,null,null,null,null,null,null,null,null,null,null,null,{"$f":"F$8","v":32},{"$f":"F$9","v":26},{"$f":"J$8","v":28},{"$f":"J$9","v":22},{"$f":"N$8","v":26},{"$f":"N$9","v":18},{"$f":"R$8","v":34},{"$f":"R$9","v":28},{"$f":"V$8","v":14},{"$f":"V$9","v":8}]
[null,null,null,null,null,null,null,null,null,null,null,null,null,null,null,null,null,null,null,null,null,null,null,null,null,null,null,null,null,null,null,null,null,null,null,null,null,null,{"$f":"F$8","v":32},{"$f":"F$9","v":26},{"$f":"J$8","v":28},{"$f":"J$9","v":22},{"$f":"N$8","v":26},{"$f":"N$9","v":18},{"$f":"R$8","v":34},{"$f":"R$9","v":28},{"$f":"V$8","v":14},{"$f":"V$9","v":8}]
[null,null,null,null,null,null,null,null,null,null,null,null,null,null,null,null,null,null,null,null,null,null,null,null,null,null,null,null,null,null,null,null,null,null,null,null,null,null,{"$f":"F$8","v":32},{"$f":"F$9","v":26},{"$f":"J$8","v":28},{"$f":"J$9","v":22},{"$f":"N$8","v":26},{"$f":"N$9","v":18},{"$f":"R$8","v":34},{"$f":"R$9","v":28},{"$f":"V$8","v":14},{"$f":"V$9","v":8}]
[null,null,null,null,null,null,null,null,null,null,null,null,null,null,null,null,null,null,null,null,null,null,null,null,null,null,null,null,null,null,null,null,null,null,null,null,null,null,{"$f":"F$8","v":32},{"$f":"F$9","v":26},{"$f":"J$8","v":28},{"$f":"J$9","v":22},{"$f":"N$8","v":26},{"$f":"N$9","v":18},{"$f":"R$8","v":34},{"$f":"R$9","v":28},{"$f":"V$8","v":14},{"$f":"V$9","v":8}]

{"sheet":"STAPH","index":5,"n_rows":44,"n_cols":78,"rows_kept":44,"cut":false,"hidden":false,"merged":[[4,66,4,67],[4,0,4,1],[4,3,4,38],[4,60,4,61],[4,62,4,63],[4,64,4,65],[4,68,4,69],[4,70,4,71],[4,72,4,73],[4,74,4,75],[4,76,4,77]]}
["Stafylokokker (STAPH)"]
["2019-10-01",null,null,"PA Jenum"]
["Registrér etter at måleverdiene er lagt inn"]
[]
["Ukentlig",null,null,"S.aureus  ATCC 29213",null,null,null,null,null,null,null,null,null,null,null,null,null,null,null,null,null,null,null,null,null,null,null,null,null,null,null,null,null,null,null,null,null,null,null,null,null,null,null,null,null,null,null,null,null,null,null,null,null,null,null,null,null,null,null,null,{"$f":"E6","v":"E         15"},null,{"$f":"I6","v":"DA         2"},null,{"$f":"M6","v":"FOX 30"},null,{"$f":"Q6","v":"CN     10"},null,{"$f":"U6","v":"LZD    10"},null,{"$f":"Y6","v":"P           1"},null,"FD 10",null,"MUP 200",null,"RD 5"]
["Dato","Nr",null,"Erytromycin 15","E         15","Sonegrenser","Target","Clindamycin 2","DA         2","Sonegrenser","Target","Cefoxitin 30","FOX 30","Sonegrenser","Target","Gentamicin 10","CN     10","Sonegrenser","Target","Linezolid 10","LZD    10","Sonegrenser","Target","Penicillin 1 U","P           1","Sonegrenser","Target","Fucidin 10","FD     10","Sonegrenser","Target","Mupirocin 200","MUP   200","Sonegrenser","Target","Rifampicin  5","RD          5","Sonegrenser","Target",null,null,null,null,null,null,null,null,null,null,null,null,null,null,null,null,null,null,null,null,null,"Øvre","Nedre","Øvre","Nedre","Øvre","Nedre","Øvre","Nedre","Øvre","Nedre","Øvre","Nedre","Øvre","Nedre","Øvre","Nedre","Øvre","Nedre"]
["Snitt","Siste 30",null,{"$f":"AVERAGE(D$15:D$44)","v":25.5},"+-2SD",{"$f":"IF(F8=\"\",\"\",IF(D7>(3+((F8+F9)/2)),\"NB\",IF(D7<(-3+((F8+F9)/2)),\"NB\",\"OK\")))","v":"OK"},26,{"$f":"AVERAGE(H$15:H$44)","v":25.5},"+-2SD",{"$f":"IF(J8=\"\",\"\",IF(H7>(3+((J8+J9)/2)),\"NB\",IF(H7<(-3+((J8+J9)/2)),\"NB\",\"OK\")))","v":"OK"},26,{"$f":"AVERAGE(L$15:L$44)","v":27.75},"+-2SD",{"$f":"IF(N8=\"\",\"\",IF(L7>(3+((N8+N9)/2)),\"NB\",IF(L7<(-3+((N8+N9)/2)),\"NB\",\"OK\")))","v":"OK"},27,{"$f":"AVERAGE(P$15:P$44)","v":21.75},"+-2SD",{"$f":"IF(R8=\"\",\"\",IF(P7>(3+((R8+R9)/2)),\"NB\",IF(P7<(-3+((R8+R9)/2)),\"NB\",\"OK\")))","v":"OK"},22,{"$f":"AVERAGE(T$15:T$44)","v":24},"+-2SD",{"$f":"IF(V8=\"\",\"\",IF(T7>(3+((V8+V9)/2)),\"NB\",IF(T7<(-3+((V8+V9)/2)),\"NB\",\"OK\")))","v":"OK"},24,{"$f":"AVERAGE(X$15:X$44)","v":13.75},"+-2SD",{"$f":"IF(Z8=\"\",\"\",IF(X7>(3+((Z8+Z9)/2)),\"NB\",IF(X7<(-3+((Z8+Z9)/2)),\"NB\",\"OK\")))","v":"OK"},15,{"$f":"AVERAGE(AB$15:AB$44)","v":28.25},"+-2SD",{"$f":"IF(AD8=\"\",\"\",IF(AB7>(3+((AD8+AD9)/2)),\"NB\",IF(AB7<(-3+((AD8+AD9)/2)),\"NB\",\"OK\")))","v":"OK"},29,{"$f":"AVERAGE(AF$15:AF$44)","v":32},"+-2SD",{"$f":"IF(AH8=\"\",\"\",IF(AF7>(3+((AH8+AH9)/2)),\"NB\",IF(AF7<(-3+((AH8+AH9)/2)),\"NB\",\"OK\")))","v":"OK"},34,{"$f":"AVERAGE(AJ$15:AJ$44)","v":31.25},"+-2SD",{"$f":"IF(AL8=\"\",\"\",IF(AJ7>(3+((AL8+AL9)/2)),\"NB\",IF(AJ7<(-3+((AL8+AL9)/2)),\"NB\",\"OK\")))","v":"OK"},33,null,null,null,null,null,null,null,null,null,null,null,null,null,null,null,null,null,null,null,null,null,{"$f":"F$8","v":29},{"$f":"F$9","v":23},{"$f":"J$8","v":29},{"$f":"J$9","v":23},{"$f":"N$8","v":30},{"$f":"N$9","v":24},{"$f":"R$8","v":25},{"$f":"R$9","v":19},{"$f":"V$8","v":27},{"$f":"V$9","v":21},{"$f":"Z$8","v":18},{"$f":"Z$9","v":12},{"$f":"AD$8","v":32},{"$f":"AD$9","v":26},{"$f":"AH$8","v":37},{"$f":"AH$9","v":31},{"$f":"AL$8","v":36},{"$f":"AL$9","v":30}]
["SD","Siste 30",null,{"$f":"STDEV(D$15:D$44)","v":0.57735026918962573},{"$f":"D7+(2*D8)","v":26.654700538379252},29,null,{"$f":"STDEV(H$15:H$44)","v":0.57735026918962573},{"$f":"H7+(2*H8)","v":26.654700538379252},29,null,{"$f":"STDEV(L$15:L$44)","v":0.5},{"$f":"L7+(2*L8)","v":28.75},30,null,{"$f":"STDEV(P$15:P$44)","v":0.5},{"$f":"P7+(2*P8)","v":22.75},25,null,{"$f":"STDEV(T$15:T$44)","v":0},{"$f":"T7+(2*T8)","v":24},27,null,{"$f":"STDEV(X$15:X$44)","v":0.5},{"$f":"X7+(2*X8)","v":14.75},18,null,{"$f":"STDEV(AB$15:AB$44)","v":0.5},{"$f":"AB7+(2*AB8)","v":29.25},32,null,{"$f":"STDEV(AF$15:AF$44)","v":0},{"$f":"AF7+(2*AF8)","v":32},37,null,{"$f":"STDEV(AJ$15:AJ$44)","v":0.5},{"$f":"AJ7+(2*AJ8)","v":32.25},36,null,null,null,null,null,null,null,null,null,null,null,null,null,null,null,null,null,null,null,null,null,null,29,23,29,23,30,24,25,19,27,21,18,12,32,26,37,31,36,30]
["CV%",null,null,{"$f":"D8/D7","v":2.2641187027044145E-2},{"$f":"D7-(2*D8)","v":24.345299461620748},23,null,{"$f":"H8/H7","v":2.2641187027044145E-2},{"$f":"H7-(2*H8)","v":24.345299461620748},23,null,{"$f":"L8/L7","v":1.8018018018018018E-2},{"$f":"L7-(2*L8)","v":26.75},24,null,{"$f":"P8/P7","v":2.2988505747126436E-2},{"$f":"P7-(2*P8)","v":20.75},19,null,{"$f":"T8/T7","v":0},{"$f":"T7-(2*T8)","v":24},21,null,{"$f":"X8/X7","v":3.6363636363636362E-2},{"$f":"X7-(2*X8)","v":12.75},12,null,{"$f":"AB8/AB7","v":1.7699115044247787E-2},{"$f":"AB7-(2*AB8)","v":27.25},26,null,{"$f":"AF8/AF7","v":0},{"$f":"AF7-(2*AF8)","v":32},31,null,{"$f":"AJ8/AJ7","v":1.6E-2},{"$f":"AJ7-(2*AJ8)","v":30.25},30,null,null,null,null,null,null,null,null,null,null,null,null,null,null,null,null,null,null,null,null,null,null,29,23,29,23,30,24,25,19,27,21,18,12,32,26,37,31,36,30]
[null,null,null,null,null,null,null,null,null,null,null,null,null,null,null,null,null,null,null,null,null,null,null,null,null,null,null,null,null,null,null,null,null,null,null,null,null,null,null,null,null,null,null,null,null,null,null,null,null,null,null,null,null,null,null,null,null,null,null,null,29,23,29,23,30,24,25,19,27,21,18,12,32,26,37,31,36,30]
[null,null,null,null,null,null,null,null,null,null,null,null,null,null,null,null,null,null,null,null,null,null,null,null,null,null,null,null,null,null,null,null,null,null,null,null,null,null,null,null,null,null,null,null,null,null,null,null,null,null,null,null,null,null,null,null,null,null,null,null,29,23,29,23,30,24,25,19,27,21,18,12,32,26,37,31,36,30]
["Legg inn diameter i hele millimeter i fargede felt i Rad 13",null,null,null,null,null,null,null,null,null,null,null,null,null,null,null,null,null,null,null,null,null,null,null,null,null,null,null,null,null,null,null,null,null,null,null,null,null,null,null,null,null,null,null,null,null,null,null,null,null,null,null,null,null,null,null,null,null,null,null,29,23,29,23,30,24,25,19,27,21,18,12,32,26,37,31,36,30]
[]
[null,null,"Initialer, Avvik, Komm.",null,"Avvik","s30","RT",null,"Avvik","s30","RT",null,"Avvik","s30","RT",null,"Avvik","s30","RT",null,"Avvik","s30","RT",null,"Avvik","s30","RT",null,"Avvik","s30","RT",null,"Avvik","s30","RT",null,"Avvik","s30","RT",null,null,null,null,null,null,null,null,null,null,null,null,null,null,null,null,null,null,null,null,null,29,23,29,23,30,24,25,19,27,21,18,12,32,26,37,31,36,30]
["2019-09-25",1,null,26,{"$f":"IF(D15=0,\"\",((D15-$D$7)/$D$7))","v":1.9607843137254902E-2},{"$f":"IF(E15=\"\",\"\",(IF((ABS(E15)>($D$9*3)),\"AV\",IF((ABS(E15)>($D$9*2)),\"NB\",\"\"))))","v":""},"",26,{"$f":"(H15-$H$7)/$H$7","v":1.9607843137254902E-2},{"$f":"IF((ABS(I15)>($H$9*3)),\"AV\",IF((ABS(I15)>($H$9*2)),\"NB\",\"\"))","v":""},"",28,{"$f":"(L15-$L$7)/$L$7","v":9.0090090090090089E-3},{"$f":"IF((ABS(M15)>($L$9*3)),\"AV\",IF((ABS(M15)>($L$9*2)),\"NB\",\"\"))","v":""},"",22,{"$f":"(P15-$P$7)/$P$7","v":1.1494252873563218E-2},{"$f":"IF((ABS(Q15)>($P$9*3)),\"AV\",IF((ABS(Q15)>($P$9*2)),\"NB\",\"\"))","v":""},"",24,{"$f":"(T15-$T$7)/$T$7","v":0},{"$f":"IF((ABS(U15)>($T$9*3)),\"AV\",IF((ABS(U15)>($T$9*2)),\"NB\",\"\"))","v":""},"",14,{"$f":"(X15-$X$7)/$X$7","v":1.8181818181818181E-2},{"$f":"IF((ABS(Y15)>($X$9*3)),\"AV\",IF((ABS(Y15)>($X$9*2)),\"NB\",\"\"))","v":""},"",29,{"$f":"(AB15-$AB$7)/$AB$7","v":2.6548672566371681E-2},{"$f":"IF((ABS(AC15)>($AB$9*3)),\"AV\",IF((ABS(AC15)>($AB$9*2)),\"NB\",\"\"))","v":""},"",32,{"$f":"(AF15-$AF$7)/$AF$7","v":0},{"$f":"IF((ABS(AG15)>($AF$9*3)),\"AV\",IF((ABS(AG15)>($AF$9*2)),\"NB\",\"\"))","v":""},"",32,{"$f":"(AJ15-$AJ$7)/$AJ$7","v":2.4E-2},{"$f":"IF((ABS(AK15)>($AJ$9*3)),\"AV\",IF((ABS(AK15)>($AJ$9*2)),\"NB\",\"\"))","v":""},"",null,null,null,null,null,null,null,null,null,null,null,null,null,null,null,null,null,null,null,null,null,29,23,29,23,30,24,25,19,27,21,18,12,32,26,37,31,36,30]
["2019-09-18",{"$f":"B15+1","v":2},null,26,{"$f":"IF(D16=0,\"\",((D16-$D$7)/$D$7))","v":1.9607843137254902E-2},{"$f":"IF(E16=\"\",\"\",(IF((ABS(E16)>($D$9*3)),\"AV\",IF((ABS(E16)>($D$9*2)),\"NB\",\"\"))))","v":""},"",26,{"$f":"(H16-$H$7)/$H$7","v":1.9607843137254902E-2},{"$f":"IF((ABS(I16)>($H$9*3)),\"AV\",IF((ABS(I16)>($H$9*2)),\"NB\",\"\"))","v":""},"",28,{"$f":"(L16-$L$7)/$L$7","v":9.0090090090090089E-3},{"$f":"IF((ABS(M16)>($L$9*3)),\"AV\",IF((ABS(M16)>($L$9*2)),\"NB\",\"\"))","v":""},"",22,{"$f":"(P16-$P$7)/$P$7","v":1.1494252873563218E-2},{"$f":"IF((ABS(Q16)>($P$9*3)),\"AV\",IF((ABS(Q16)>($P$9*2)),\"NB\",\"\"))","v":""},"",24,{"$f":"(T16-$T$7)/$T$7","v":0},{"$f":"IF((ABS(U16)>($T$9*3)),\"AV\",IF((ABS(U16)>($T$9*2)),\"NB\",\"\"))","v":""},"",14,{"$f":"(X16-$X$7)/$X$7","v":1.8181818181818181E-2},{"$f":"IF((ABS(Y16)>($X$9*3)),\"AV\",IF((ABS(Y16)>($X$9*2)),\"NB\",\"\"))","v":""},"",28,{"$f":"(AB16-$AB$7)/$AB$7","v":-8.8495575221238937E-3},{"$f":"IF((ABS(AC16)>($AB$9*3)),\"AV\",IF((ABS(AC16)>($AB$9*2)),\"NB\",\"\"))","v":""},"",32,{"$f":"(AF16-$AF$7)/$AF$7","v":0},{"$f":"IF((ABS(AG16)>($AF$9*3)),\"AV\",IF((ABS(AG16)>($AF$9*2)),\"NB\",\"\"))","v":""},"",31,{"$f":"(AJ16-$AJ$7)/$AJ$7","v":-8.0000000000000002E-3},{"$f":"IF((ABS(AK16)>($AJ$9*3)),\"AV\",IF((ABS(AK16)>($AJ$9*2)),\"NB\",\"\"))","v":""},"",null,null,null,null,null,null,null,null,null,null,null,null,null,null,null,null,null,null,null,null,null,{"$f":"F$8","v":29},{"$f":"F$9","v":23},{"$f":"J$8","v":29},{"$f":"J$9","v":23},{"$f":"N$8","v":30},{"$f":"N$9","v":24},{"$f":"R$8","v":25},{"$f":"R$9","v":19},{"$f":"V$8","v":27},{"$f":"V$9","v":21},{"$f":"Z$8","v":18},{"$f":"Z$9","v":12},{"$f":"AD$8","v":32},{"$f":"AD$9","v":26},{"$f":"AH$8","v":37},{"$f":"AH$9","v":31},{"$f":"AL$8","v":36},{"$f":"AL$9","v":30}]
["2019-09-11",3,null,25,{"$f":"IF(D17=0,\"\",((D17-$D$7)/$D$7))","v":-1.9607843137254902E-2},{"$f":"IF(E17=\"\",\"\",(IF((ABS(E17)>($D$9*3)),\"AV\",IF((ABS(E17)>($D$9*2)),\"NB\",\"\"))))","v":""},"",25,{"$f":"(H17-$H$7)/$H$7","v":-1.9607843137254902E-2},{"$f":"IF((ABS(I17)>($H$9*3)),\"AV\",IF((ABS(I17)>($H$9*2)),\"NB\",\"\"))","v":""},"",28,{"$f":"(L17-$L$7)/$L$7","v":9.0090090090090089E-3},{"$f":"IF((ABS(M17)>($L$9*3)),\"AV\",IF((ABS(M17)>($L$9*2)),\"NB\",\"\"))","v":""},"",22,{"$f":"(P17-$P$7)/$P$7","v":1.1494252873563218E-2},{"$f":"IF((ABS(Q17)>($P$9*3)),\"AV\",IF((ABS(Q17)>($P$9*2)),\"NB\",\"\"))","v":""},"",24,{"$f":"(T17-$T$7)/$T$7","v":0},{"$f":"IF((ABS(U17)>($T$9*3)),\"AV\",IF((ABS(U17)>($T$9*2)),\"NB\",\"\"))","v":""},"",14,{"$f":"(X17-$X$7)/$X$7","v":1.8181818181818181E-2},{"$f":"IF((ABS(Y17)>($X$9*3)),\"AV\",IF((ABS(Y17)>($X$9*2)),\"NB\",\"\"))","v":""},"",28,{"$f":"(AB17-$AB$7)/$AB$7","v":-8.8495575221238937E-3},{"$f":"IF((ABS(AC17)>($AB$9*3)),\"AV\",IF((ABS(AC17)>($AB$9*2)),\"NB\",\"\"))","v":""},"",32,{"$f":"(AF17-$AF$7)/$AF$7","v":0},{"$f":"IF((ABS(AG17)>($AF$9*3)),\"AV\",IF((ABS(AG17)>($AF$9*2)),\"NB\",\"\"))","v":""},"",31,{"$f":"(AJ17-$AJ$7)/$AJ$7","v":-8.0000000000000002E-3},{"$f":"IF((ABS(AK17)>($AJ$9*3)),\"AV\",IF((ABS(AK17)>($AJ$9*2)),\"NB\",\"\"))","v":""},"",null,null,null,null,null,null,null,null,null,null,null,null,null,null,null,null,null,null,null,null,null,29,23,29,23,30,24,25,19,27,21,18,12,32,26,37,31,36,30]
["2019-09-04",4,null,25,{"$f":"IF(D18=0,\"\",((D18-$D$7)/$D$7))","v":-1.9607843137254902E-2},{"$f":"IF(E18=\"\",\"\",(IF((ABS(E18)>($D$9*3)),\"AV\",IF((ABS(E18)>($D$9*2)),\"NB\",\"\"))))","v":""},"",25,{"$f":"(H18-$H$7)/$H$7","v":-1.9607843137254902E-2},{"$f":"IF((ABS(I18)>($H$9*3)),\"AV\",IF((ABS(I18)>($H$9*2)),\"NB\",\"\"))","v":""},"",27,{"$f":"(L18-$L$7)/$L$7","v":-2.7027027027027029E-2},{"$f":"IF((ABS(M18)>($L$9*3)),\"AV\",IF((ABS(M18)>($L$9*2)),\"NB\",\"\"))","v":""},"",21,{"$f":"(P18-$P$7)/$P$7","v":-3.4482758620689655E-2},{"$f":"IF((ABS(Q18)>($P$9*3)),\"AV\",IF((ABS(Q18)>($P$9*2)),\"NB\",\"\"))","v":""},"",24,{"$f":"(T18-$T$7)/$T$7","v":0},{"$f":"IF((ABS(U18)>($T$9*3)),\"AV\",IF((ABS(U18)>($T$9*2)),\"NB\",\"\"))","v":""},"",13,{"$f":"(X18-$X$7)/$X$7","v":-5.4545454545454543E-2},{"$f":"IF((ABS(Y18)>($X$9*3)),\"AV\",IF((ABS(Y18)>($X$9*2)),\"NB\",\"\"))","v":""},"",28,{"$f":"(AB18-$AB$7)/$AB$7","v":-8.8495575221238937E-3},{"$f":"IF((ABS(AC18)>($AB$9*3)),\"AV\",IF((ABS(AC18)>($AB$9*2)),\"NB\",\"\"))","v":""},"",32,{"$f":"(AF18-$AF$7)/$AF$7","v":0},{"$f":"IF((ABS(AG18)>($AF$9*3)),\"AV\",IF((ABS(AG18)>($AF$9*2)),\"NB\",\"\"))","v":""},"",31,{"$f":"(AJ18-$AJ$7)/$AJ$7","v":-8.0000000000000002E-3},{"$f":"IF((ABS(AK18)>($AJ$9*3)),\"AV\",IF((ABS(AK18)>($AJ$9*2)),\"NB\",\"\"))","v":""},"",null,null,null,null,null,null,null,null,null,null,null,null,null,null,null,null,null,null,null,null,null,{"$f":"F$8","v":29},{"$f":"F$9","v":23},{"$f":"J$8","v":29},{"$f":"J$9","v":23},{"$f":"N$8","v":30},{"$f":"N$9","v":24},{"$f":"R$8","v":25},{"$f":"R$9","v":19},{"$f":"V$8","v":27},{"$f":"V$9","v":21},{"$f":"Z$8","v":18},{"$f":"Z$9","v":12},{"$f":"AD$8","v":32},{"$f":"AD$9","v":26},{"$f":"AH$8","v":37},{"$f":"AH$9","v":31},{"$f":"AL$8","v":36},{"$f":"AL$9","v":30}]
[null,null,null,null,null,null,null,null,null,null,null,null,null,null,null,null,null,null,null,null,null,null,null,null,null,null,null,null,null,null,null,null,null,null,null,null,null,null,null,null,null,null,null,null,null,null,null,null,null,null,null,null,null,null,null,null,null,null,null,null,29,23,29,23,30,24,25,19,27,21,18,12,32,26,37,31,36,30]
[null,null,null,null,null,null,null,null,null,null,null,null,null,null,null,null,null,null,null,null,null,null,null,null,null,null,null,null,null,null,null,null,null,null,null,null,null,null,null,null,null,null,null,null,null,null,null,null,null,null,null,null,null,null,null,null,null,null,null,null,{"$f":"F$8","v":29},{"$f":"F$9","v":23},{"$f":"J$8","v":29},{"$f":"J$9","v":23},{"$f":"N$8","v":30},{"$f":"N$9","v":24},{"$f":"R$8","v":25},{"$f":"R$9","v":19},{"$f":"V$8","v":27},{"$f":"V$9","v":21},{"$f":"Z$8","v":18},{"$f":"Z$9","v":12},{"$f":"AD$8","v":32},{"$f":"AD$9","v":26},{"$f":"AH$8","v":37},{"$f":"AH$9","v":31},{"$f":"AL$8","v":36},{"$f":"AL$9","v":30}]
[null,null,null,null,null,null,null,null,null,null,null,null,null,null,null,null,null,null,null,null,null,null,null,null,null,null,null,null,null,null,null,null,null,null,null,null,null,null,null,null,null,null,null,null,null,null,null,null,null,null,null,null,null,null,null,null,null,null,null,null,29,23,29,23,30,24,25,19,27,21,18,12,32,26,37,31,36,30]
[null,null,null,null,null,null,null,null,null,null,null,null,null,null,null,null,null,null,null,null,null,null,null,null,null,null,null,null,null,null,null,null,null,null,null,null,null,null,null,null,null,null,null,null,null,null,null,null,null,null,null,null,null,null,null,null,null,null,null,null,{"$f":"F$8","v":29},{"$f":"F$9","v":23},{"$f":"J$8","v":29},{"$f":"J$9","v":23},{"$f":"N$8","v":30},{"$f":"N$9","v":24},{"$f":"R$8","v":25},{"$f":"R$9","v":19},{"$f":"V$8","v":27},{"$f":"V$9","v":21},{"$f":"Z$8","v":18},{"$f":"Z$9","v":12},{"$f":"AD$8","v":32},{"$f":"AD$9","v":26},{"$f":"AH$8","v":37},{"$f":"AH$9","v":31},{"$f":"AL$8","v":36},{"$f":"AL$9","v":30}]
[null,null,null,null,null,null,null,null,null,null,null,null,null,null,null,null,null,null,null,null,null,null,null,null,null,null,null,null,null,null,null,null,null,null,null,null,null,null,null,null,null,null,null,null,null,null,null,null,null,null,null,null,null,null,null,null,null,null,null,null,29,23,29,23,30,24,25,19,27,21,18,12,32,26,37,31,36,30]
[null,null,null,null,null,null,null,null,null,null,null,null,null,null,null,null,null,null,null,null,null,null,null,null,null,null,null,null,null,null,null,null,null,null,null,null,null,null,null,null,null,null,null,null,null,null,null,null,null,null,null,null,null,null,null,null,null,null,null,null,{"$f":"F$8","v":29},{"$f":"F$9","v":23},{"$f":"J$8","v":29},{"$f":"J$9","v":23},{"$f":"N$8","v":30},{"$f":"N$9","v":24},{"$f":"R$8","v":25},{"$f":"R$9","v":19},{"$f":"V$8","v":27},{"$f":"V$9","v":21},{"$f":"Z$8","v":18},{"$f":"Z$9","v":12},{"$f":"AD$8","v":32},{"$f":"AD$9","v":26},{"$f":"AH$8","v":37},{"$f":"AH$9","v":31},{"$f":"AL$8","v":36},{"$f":"AL$9","v":30}]
[null,null,null,null,null,null,null,null,null,null,null,null,null,null,null,null,null,null,null,null,null,null,null,null,null,null,null,null,null,null,null,null,null,null,null,null,null,null,null,null,null,null,null,null,null,null,null,null,null,null,null,null,null,null,null,null,null,null,null,null,29,23,29,23,30,24,25,19,27,21,18,12,32,26,37,31,36,30]
[null,null,null,null,null,null,null,null,null,null,null,null,null,null,null,null,null,null,null,null,null,null,null,null,null,null,null,null,null,null,null,null,null,null,null,null,null,null,null,null,null,null,null,null,null,null,null,null,null,null,null,null,null,null,null,null,null,null,null,null,{"$f":"F$8","v":29},{"$f":"F$9","v":23},{"$f":"J$8","v":29},{"$f":"J$9","v":23},{"$f":"N$8","v":30},{"$f":"N$9","v":24},{"$f":"R$8","v":25},{"$f":"R$9","v":19},{"$f":"V$8","v":27},{"$f":"V$9","v":21},{"$f":"Z$8","v":18},{"$f":"Z$9","v":12},{"$f":"AD$8","v":32},{"$f":"AD$9","v":26},{"$f":"AH$8","v":37},{"$f":"AH$9","v":31},{"$f":"AL$8","v":36},{"$f":"AL$9","v":30}]
[null,null,null,null,null,null,null,null,null,null,null,null,null,null,null,null,null,null,null,null,null,null,null,null,null,null,null,null,null,null,null,null,null,null,null,null,null,null,null,null,null,null,null,null,null,null,null,null,null,null,null,null,null,null,null,null,null,null,null,null,29,23,29,23,30,24,25,19,27,21,18,12,32,26,37,31,36,30]
[null,null,null,null,null,null,null,null,null,null,null,null,null,null,null,null,null,null,null,null,null,null,null,null,null,null,null,null,null,null,null,null,null,null,null,null,null,null,null,null,null,null,null,null,null,null,null,null,null,null,null,null,null,null,null,null,null,null,null,null,{"$f":"F$8","v":29},{"$f":"F$9","v":23},{"$f":"J$8","v":29},{"$f":"J$9","v":23},{"$f":"N$8","v":30},{"$f":"N$9","v":24},{"$f":"R$8","v":25},{"$f":"R$9","v":19},{"$f":"V$8","v":27},{"$f":"V$9","v":21},{"$f":"Z$8","v":18},{"$f":"Z$9","v":12},{"$f":"AD$8","v":32},{"$f":"AD$9","v":26},{"$f":"AH$8","v":37},{"$f":"AH$9","v":31},{"$f":"AL$8","v":36},{"$f":"AL$9","v":30}]
[null,null,null,null,null,null,null,null,null,null,null,null,null,null,null,null,null,null,null,null,null,null,null,null,null,null,null,null,null,null,null,null,null,null,null,null,null,null,null,null,null,null,null,null,null,null,null,null,null,null,null,null,null,null,null,null,null,null,null,null,29,23,29,23,30,24,25,19,27,21,18,12,32,26,37,31,36,30]
[null,null,null,null,null,null,null,null,null,null,null,null,null,null,null,null,null,null,null,null,null,null,null,null,null,null,null,null,null,null,null,null,null,null,null,null,null,null,null,null,null,null,null,null,null,null,null,null,null,null,null,null,null,null,null,null,null,null,null,null,{"$f":"F$8","v":29},{"$f":"F$9","v":23},{"$f":"J$8","v":29},{"$f":"J$9","v":23},{"$f":"N$8","v":30},{"$f":"N$9","v":24},{"$f":"R$8","v":25},{"$f":"R$9","v":19},{"$f":"V$8","v":27},{"$f":"V$9","v":21},{"$f":"Z$8","v":18},{"$f":"Z$9","v":12},{"$f":"AD$8","v":32},{"$f":"AD$9","v":26},{"$f":"AH$8","v":37},{"$f":"AH$9","v":31},{"$f":"AL$8","v":36},{"$f":"AL$9","v":30}]
[null,null,null,null,null,null,null,null,null,null,null,null,null,null,null,null,null,null,null,null,null,null,null,null,null,null,null,null,null,null,null,null,null,null,null,null,null,null,null,null,null,null,null,null,null,null,null,null,null,null,null,null,null,null,null,null,null,null,null,null,29,23,29,23,30,24,25,19,27,21,18,12,32,26,37,31,36,30]
[null,null,null,null,null,null,null,null,null,null,null,null,null,null,null,null,null,null,null,null,null,null,null,null,null,null,null,null,null,null,null,null,null,null,null,null,null,null,null,null,null,null,null,null,null,null,null,null,null,null,null,null,null,null,null,null,null,null,null,null,{"$f":"F$8","v":29},{"$f":"F$9","v":23},{"$f":"J$8","v":29},{"$f":"J$9","v":23},{"$f":"N$8","v":30},{"$f":"N$9","v":24},{"$f":"R$8","v":25},{"$f":"R$9","v":19},{"$f":"V$8","v":27},{"$f":"V$9","v":21},{"$f":"Z$8","v":18},{"$f":"Z$9","v":12},{"$f":"AD$8","v":32},{"$f":"AD$9","v":26},{"$f":"AH$8","v":37},{"$f":"AH$9","v":31},{"$f":"AL$8","v":36},{"$f":"AL$9","v":30}]
[null,null,null,null,null,null,null,null,null,null,null,null,null,null,null,null,null,null,null,null,null,null,null,null,null,null,null,null,null,null,null,null,null,null,null,null,null,null,null,null,null,null,null,null,null,null,null,null,null,null,null,null,null,null,null,null,null,null,null,null,29,23,29,23,30,24,25,19,27,21,18,12,32,26,37,31,36,30]
[null,null,null,null,null,null,null,null,null,null,null,null,null,null,null,null,null,null,null,null,null,null,null,null,null,null,null,null,null,null,null,null,null,null,null,null,null,null,null,null,null,null,null,null,null,null,null,null,null,null,null,null,null,null,null,null,null,null,null,null,{"$f":"F$8","v":29},{"$f":"F$9","v":23},{"$f":"J$8","v":29},{"$f":"J$9","v":23},{"$f":"N$8","v":30},{"$f":"N$9","v":24},{"$f":"R$8","v":25},{"$f":"R$9","v":19},{"$f":"V$8","v":27},{"$f":"V$9","v":21},{"$f":"Z$8","v":18},{"$f":"Z$9","v":12},{"$f":"AD$8","v":32},{"$f":"AD$9","v":26},{"$f":"AH$8","v":37},{"$f":"AH$9","v":31},{"$f":"AL$8","v":36},{"$f":"AL$9","v":30}]
[null,null,null,null,null,null,null,null,null,null,null,null,null,null,null,null,null,null,null,null,null,null,null,null,null,null,null,null,null,null,null,null,null,null,null,null,null,null,null,null,null,null,null,null,null,null,null,null,null,null,null,null,null,null,null,null,null,null,null,null,29,23,29,23,30,24,25,19,27,21,18,12,32,26,37,31,36,30]
[null,null,null,null,null,null,null,null,null,null,null,null,null,null,null,null,null,null,null,null,null,null,null,null,null,null,null,null,null,null,null,null,null,null,null,null,null,null,null,null,null,null,null,null,null,null,null,null,null,null,null,null,null,null,null,null,null,null,null,null,{"$f":"F$8","v":29},{"$f":"F$9","v":23},{"$f":"J$8","v":29},{"$f":"J$9","v":23},{"$f":"N$8","v":30},{"$f":"N$9","v":24},{"$f":"R$8","v":25},{"$f":"R$9","v":19},{"$f":"V$8","v":27},{"$f":"V$9","v":21},{"$f":"Z$8","v":18},{"$f":"Z$9","v":12},{"$f":"AD$8","v":32},{"$f":"AD$9","v":26},{"$f":"AH$8","v":37},{"$f":"AH$9","v":31},{"$f":"AL$8","v":36},{"$f":"AL$9","v":30}]
[null,null,null,null,null,null,null,null,null,null,null,null,null,null,null,null,null,null,null,null,null,null,null,null,null,null,null,null,null,null,null,null,null,null,null,null,null,null,null,null,null,null,null,null,null,null,null,null,null,null,null,null,null,null,null,null,null,null,null,null,29,23,29,23,30,24,25,19,27,21,18,12,32,26,37,31,36,30]
[null,null,null,null,null,null,null,null,null,null,null,null,null,null,null,null,null,null,null,null,null,null,null,null,null,null,null,null,null,null,null,null,null,null,null,null,null,null,null,null,null,null,null,null,null,null,null,null,null,null,null,null,null,null,null,null,null,null,null,null,{"$f":"F$8","v":29},{"$f":"F$9","v":23},{"$f":"J$8","v":29},{"$f":"J$9","v":23},{"$f":"N$8","v":30},{"$f":"N$9","v":24},{"$f":"R$8","v":25},{"$f":"R$9","v":19},{"$f":"V$8","v":27},{"$f":"V$9","v":21},{"$f":"Z$8","v":18},{"$f":"Z$9","v":12},{"$f":"AD$8","v":32},{"$f":"AD$9","v":26},{"$f":"AH$8","v":37},{"$f":"AH$9","v":31},{"$f":"AL$8","v":36},{"$f":"AL$9","v":30}]
[null,null,null,null,null,null,null,null,null,null,null,null,null,null,null,null,null,null,null,null,null,null,null,null,null,null,null,null,null,null,null,null,null,null,null,null,null,null,null,null,null,null,null,null,null,null,null,null,null,null,null,null,null,null,null,null,null,null,null,null,29,23,29,23,30,24,25,19,27,21,18,12,32,26,37,31,36,30]
[null,null,null,null,null,null,null,null,null,null,null,null,null,null,null,null,null,null,null,null,null,null,null,null,null,null,null,null,null,null,null,null,null,null,null,null,null,null,null,null,null,null,null,null,null,null,null,null,null,null,null,null,null,null,null,null,null,null,null,null,{"$f":"F$8","v":29},{"$f":"F$9","v":23},{"$f":"J$8","v":29},{"$f":"J$9","v":23},{"$f":"N$8","v":30},{"$f":"N$9","v":24},{"$f":"R$8","v":25},{"$f":"R$9","v":19},{"$f":"V$8","v":27},{"$f":"V$9","v":21},{"$f":"Z$8","v":18},{"$f":"Z$9","v":12},{"$f":"AD$8","v":32},{"$f":"AD$9","v":26},{"$f":"AH$8","v":37},{"$f":"AH$9","v":31},{"$f":"AL$8","v":36},{"$f":"AL$9","v":30}]
[null,null,null,null,null,null,null,null,null,null,null,null,null,null,null,null,null,null,null,null,null,null,null,null,null,null,null,null,null,null,null,null,null,null,null,null,null,null,null,null,null,null,null,null,null,null,null,null,null,null,null,null,null,null,null,null,null,null,null,null,29,23,29,23,30,24,25,19,27,21,18,12,32,26,37,31,36,30]
[null,null,null,null,null,null,null,null,null,null,null,null,null,null,null,null,null,null,null,null,null,null,null,null,null,null,null,null,null,null,null,null,null,null,null,null,null,null,null,null,null,null,null,null,null,null,null,null,null,null,null,null,null,null,null,null,null,null,null,null,{"$f":"F$8","v":29},{"$f":"F$9","v":23},{"$f":"J$8","v":29},{"$f":"J$9","v":23},{"$f":"N$8","v":30},{"$f":"N$9","v":24},{"$f":"R$8","v":25},{"$f":"R$9","v":19},{"$f":"V$8","v":27},{"$f":"V$9","v":21},{"$f":"Z$8","v":18},{"$f":"Z$9","v":12},{"$f":"AD$8","v":32},{"$f":"AD$9","v":26},{"$f":"AH$8","v":37},{"$f":"AH$9","v":31},{"$f":"AL$8","v":36},{"$f":"AL$9","v":30}]
[null,null,null,null,null,null,null,null,null,null,null,null,null,null,null,null,null,null,null,null,null,null,null,null,null,null,null,null,null,null,null,null,null,null,null,null,null,null,null,null,null,null,null,null,null,null,null,null,null,null,null,null,null,null,null,null,null,null,null,null,29,23,29,23,30,24,25,19,27,21,18,12,32,26,37,31,36,30]
[null,null,null,null,null,null,null,null,null,null,null,null,null,null,null,null,null,null,null,null,null,null,null,null,null,null,null,null,null,null,null,null,null,null,null,null,null,null,null,null,null,null,null,null,null,null,null,null,null,null,null,null,null,null,null,null,null,null,null,null,{"$f":"F$8","v":29},{"$f":"F$9","v":23},{"$f":"J$8","v":29},{"$f":"J$9","v":23},{"$f":"N$8","v":30},{"$f":"N$9","v":24},{"$f":"R$8","v":25},{"$f":"R$9","v":19},{"$f":"V$8","v":27},{"$f":"V$9","v":21},{"$f":"Z$8","v":18},{"$f":"Z$9","v":12},{"$f":"AD$8","v":32},{"$f":"AD$9","v":26},{"$f":"AH$8","v":37},{"$f":"AH$9","v":31},{"$f":"AL$8","v":36},{"$f":"AL$9","v":30}]

{"sheet":"MRSA","index":6,"n_rows":42,"n_cols":15,"rows_kept":42,"cut":false,"hidden":false,"merged":[[4,0,4,1],[4,3,4,6],[4,13,4,14]]}
["MRSA "]
["2019-10-01",null,null,"PA Jenum"]
["Registrér etter at måleverdiene er lagt inn"]
[]
["Ukentlig",null,null,"S. aureus  CCUG 67181 - NCTC 12493              ",null,null,null,null,null,null,null,null,null,"FOX"]
["Dato","Nr",null,"Cefoxitin 30","FOX","Sonegrenser","Target",null,null,null,null,null,null,"Øvre","Nedre"]
["Snitt","Siste 30",null,{"$f":"AVERAGE(D$15:D$44)","v":18},"+-2SD",{"$f":"IF(F8=\"\",\"\",IF(D7>(3+((F8+F9)/2)),\"NB\",IF(D7<(-3+((F8+F9)/2)),\"NB\",\"OK\")))","v":"OK"},17]
["SD","Siste 30",null,{"$f":"STDEV(D$15:D$44)","v":0.81649658092772603},{"$f":"D7+(2*D8)","v":19.632993161855453},20]
["CV%",null,null,{"$f":"IF(D8=0,\"\",(D8/D7))","v":4.5360921162651446E-2},{"$f":"D7-(2*D8)","v":16.367006838144547},14]
[]
[]
["Legg inn diameter i hele millimeter i fargede felt i Rad 13"]
[]
[null,null,"Initialer, Avvik, Komm.",null,"Avvik","s30","RT"]
["2019-09-25",1,null,18,{"$f":"(D15-$D$7)/$D$7","v":0},{"$f":"IF((ABS(E15)>($D$9*3)),\"AV\",IF((ABS(E15)>($D$9*2)),\"NB\",\"\"))","v":""},"",null,null,null,null,null,null,{"$f":"$F$8","v":20},{"$f":"$F$9","v":14}]
["2019-09-18",{"$f":"B15+1","v":2},null,17,{"$f":"(D16-$D$7)/$D$7","v":-5.5555555555555552E-2},{"$f":"IF((ABS(E16)>($D$9*3)),\"AV\",IF((ABS(E16)>($D$9*2)),\"NB\",\"\"))","v":""},"",null,null,null,null,null,null,20,14]
["2019-09-11",3,null,19,{"$f":"(D17-$D$7)/$D$7","v":5.5555555555555552E-2},{"$f":"IF((ABS(E17)>($D$9*3)),\"AV\",IF((ABS(E17)>($D$9*2)),\"NB\",\"\"))","v":""},null,null,null,null,null,null,null,20,14]
["2019-09-04",4,null,18,{"$f":"(D18-$D$7)/$D$7","v":0},{"$f":"IF((ABS(E18)>($D$9*3)),\"AV\",IF((ABS(E18)>($D$9*2)),\"NB\",\"\"))","v":""},"",null,null,null,null,null,null,20,14]
[null,null,null,null,null,null,null,null,null,null,null,null,null,20,14]
[null,null,null,null,null,null,null,null,null,null,null,null,null,20,14]
[null,null,null,null,null,null,null,null,null,null,null,null,null,20,14]
[null,null,null,null,null,null,null,null,null,null,null,null,null,20,14]
[null,null,null,null,null,null,null,null,null,null,null,null,null,20,14]
[null,null,null,null,null,null,null,null,null,null,null,null,null,20,14]
[null,null,null,null,null,null,null,null,null,null,null,null,null,20,14]
[null,null,null,null,null,null,null,null,null,null,null,null,null,20,14]
[null,null,null,null,null,null,null,null,null,null,null,null,null,20,14]
[null,null,null,null,null,null,null,null,null,null,null,null,null,20,14]
[null,null,null,null,null,null,null,null,null,null,null,null,null,20,14]
[null,null,null,null,null,null,null,null,null,null,null,null,null,20,14]
[null,null,null,null,null,null,null,null,null,null,null,null,null,20,14]
[null,null,null,null,null,null,null,null,null,null,null,null,null,20,14]
[null,null,null,null,null,null,null,null,null,null,null,null,null,20,14]
[null,null,null,null,null,null,null,null,null,null,null,null,null,20,14]
[null,null,null,null,null,null,null,null,null,null,null,null,null,20,14]
[null,null,null,null,null,null,null,null,null,null,null,null,null,20,14]
[null,null,null,null,null,null,null,null,null,null,null,null,null,20,14]
[null,null,null,null,null,null,null,null,null,null,null,null,null,20,14]
[null,null,null,null,null,null,null,null,null,null,null,null,null,20,14]
[null,null,null,null,null,null,null,null,null,null,null,null,null,20,14]
[null,null,null,null,null,null,null,null,null,null,null,null,null,20,14]
[null,null,null,null,null,null,null,null,null,null,null,null,null,20,14]

{"sheet":"CAMP","index":7,"n_rows":44,"n_cols":36,"rows_kept":44,"cut":false,"hidden":false,"merged":[[4,3,4,14],[4,0,4,1],[4,30,4,31],[4,32,4,33],[4,34,4,35]]}
["Campylobacter"]
["2019-10-01",null,null,"PA Jenum"]
["Registrér etter at måleverdiene er lagt inn"]
[]
["Ukentlig",null,null,"Campylobacter jejuni ATCC 33560 / CCUG 11284",null,null,null,null,null,null,null,null,null,null,null,null,null,null,null,null,null,null,null,null,null,null,null,null,null,null,{"$f":"E6","v":"E15"},null,{"$f":"I6","v":"CIP5"},null,{"$f":"M6","v":"TE30"}]
["Dato","Nr",null,"Erytromycin 15","E15","Sonegrenser","Target","Ciprofloxacin","CIP5","Sonegrenser","Target","Tetracyclin","TE30","Sonegrenser","Target",null,null,null,null,null,null,null,null,null,null,null,null,null,null,null,"Øvre","Nedre","Øvre","Nedre","Øvre","Nedre"]
["Snitt","Siste 30",null,{"$f":"AVERAGE(D$15:D$44)","v":29.5},"+-2SD",{"$f":"IF(F8=\"\",\"\",IF(D7>(3+((F8+F9)/2)),\"NB\",IF(D7<(-3+((F8+F9)/2)),\"NB\",\"OK\")))","v":"OK"},31,{"$f":"AVERAGE(H$15:H$44)","v":38.75},"+-2SD",{"$f":"IF(J8=\"\",\"\",IF(H7>(3+((J8+J9)/2)),\"NB\",IF(H7<(-3+((J8+J9)/2)),\"NB\",\"OK\")))","v":"OK"},38,{"$f":"AVERAGE(L$15:L$44)","v":33.75},"+-2SD",{"$f":"IF(N8=\"\",\"\",IF(L7>(3+((N8+N9)/2)),\"NB\",IF(L7<(-3+((N8+N9)/2)),\"NB\",\"OK\")))","v":"OK"},34]
["SD","Siste 30",null,{"$f":"STDEV(D$15:D$44)","v":0.57735026918962573},{"$f":"D7+(2*D8)","v":30.654700538379252},35,null,{"$f":"STDEV(H$15:H$44)","v":0.9574271077563381},{"$f":"H7+(2*H8)","v":40.664854215512676},42,null,{"$f":"STDEV(L$15:L$44)","v":0.5},{"$f":"L7+(2*L8)","v":34.75},38]
["CV%",null,null,{"$f":"D8/D7","v":1.9571195565750026E-2},{"$f":"D7-(2*D8)","v":28.345299461620748},27,null,{"$f":"H8/H7","v":2.4707796329195821E-2},{"$f":"H7-(2*H8)","v":36.835145784487324},34,null,{"$f":"L8/L7","v":1.4814814814814815E-2},{"$f":"L7-(2*L8)","v":32.75},30]
[]
[]
["Legg inn diameter i hele millimeter i fargede felt i Rad 13"]
[]
[null,null,"Initialer, Avvik, Komm.",null,"Avvik","s30","RT",null,"Avvik","s30","RT",null,"Avvik","s30","RT"]
["2019-09-12",1,null,29,{"$f":"(D15-$D$7)/$D$7","v":-1.6949152542372881E-2},{"$f":"IF((ABS(E15)>($D$9*3)),\"AV\",IF((ABS(E15)>($D$9*2)),\"NB\",\"\"))","v":""},"",38,{"$f":"(H15-$H$7)/$H$7","v":-1.935483870967742E-2},{"$f":"IF((ABS(I15)>($H$9*3)),\"AV\",IF((ABS(I15)>($H$9*2)),\"NB\",\"\"))","v":""},"",33,{"$f":"(L15-$L$7)/$L$7","v":-2.2222222222222223E-2},{"$f":"IF((ABS(M15)>($L$9*3)),\"AV\",IF((ABS(M15)>($L$9*2)),\"NB\",\"\"))","v":""},"",null,null,null,null,null,null,null,null,null,null,null,null,null,null,null,{"$f":"F$8","v":35},{"$f":"F$9","v":27},{"$f":"J$8","v":42},{"$f":"J$9","v":34},{"$f":"N$8","v":38},{"$f":"N$9","v":30}]
["2019-07-30",{"$f":"B15+1","v":2},null,30,{"$f":"(D16-$D$7)/$D$7","v":1.6949152542372881E-2},{"$f":"IF((ABS(E16)>($D$9*3)),\"AV\",IF((ABS(E16)>($D$9*2)),\"NB\",\"\"))","v":""},"",39,{"$f":"(H16-$H$7)/$H$7","v":6.4516129032258064E-3},{"$f":"IF((ABS(I16)>($H$9*3)),\"AV\",IF((ABS(I16)>($H$9*2)),\"NB\",\"\"))","v":""},"",34,{"$f":"(L16-$L$7)/$L$7","v":7.4074074074074077E-3},{"$f":"IF((ABS(M16)>($L$9*3)),\"AV\",IF((ABS(M16)>($L$9*2)),\"NB\",\"\"))","v":""},"",null,null,null,null,null,null,null,null,null,null,null,null,null,null,null,{"$f":"F$8","v":35},{"$f":"F$9","v":27},{"$f":"J$8","v":42},{"$f":"J$9","v":34},{"$f":"N$8","v":38},{"$f":"N$9","v":30}]
["2019-07-26",3,null,30,{"$f":"(D17-$D$7)/$D$7","v":1.6949152542372881E-2},{"$f":"IF((ABS(E17)>($D$9*3)),\"AV\",IF((ABS(E17)>($D$9*2)),\"NB\",\"\"))","v":""},"",38,{"$f":"(H17-$H$7)/$H$7","v":-1.935483870967742E-2},{"$f":"IF((ABS(I17)>($H$9*3)),\"AV\",IF((ABS(I17)>($H$9*2)),\"NB\",\"\"))","v":""},"",34,{"$f":"(L17-$L$7)/$L$7","v":7.4074074074074077E-3},{"$f":"IF((ABS(M17)>($L$9*3)),\"AV\",IF((ABS(M17)>($L$9*2)),\"NB\",\"\"))","v":""},"",null,null,null,null,null,null,null,null,null,null,null,null,null,null,null,{"$f":"F$8","v":35},{"$f":"F$9","v":27},{"$f":"J$8","v":42},{"$f":"J$9","v":34},{"$f":"N$8","v":38},{"$f":"N$9","v":30}]
["2019-07-04",4,null,29,{"$f":"(D18-$D$7)/$D$7","v":-1.6949152542372881E-2},{"$f":"IF((ABS(E18)>($D$9*3)),\"AV\",IF((ABS(E18)>($D$9*2)),\"NB\",\"\"))","v":""},"",40,{"$f":"(H18-$H$7)/$H$7","v":3.2258064516129031E-2},{"$f":"IF((ABS(I18)>($H$9*3)),\"AV\",IF((ABS(I18)>($H$9*2)),\"NB\",\"\"))","v":""},"",34,{"$f":"(L18-$L$7)/$L$7","v":7.4074074074074077E-3},{"$f":"IF((ABS(M18)>($L$9*3)),\"AV\",IF((ABS(M18)>($L$9*2)),\"NB\",\"\"))","v":""},"",null,null,null,null,null,null,null,null,null,null,null,null,null,null,null,{"$f":"F$8","v":35},{"$f":"F$9","v":27},{"$f":"J$8","v":42},{"$f":"J$9","v":34},{"$f":"N$8","v":38},{"$f":"N$9","v":30}]
[null,null,null,null,null,null,null,null,null,null,null,null,null,null,null,null,null,null,null,null,null,null,null,null,null,null,null,null,null,null,{"$f":"F$8","v":35},{"$f":"F$9","v":27},{"$f":"J$8","v":42},{"$f":"J$9","v":34},{"$f":"N$8","v":38},{"$f":"N$9","v":30}]
[null,null,null,null,null,null,null,null,null,null,null,null,null,null,null,null,null,null,null,null,null,null,null,null,null,null,null,null,null,null,{"$f":"F$8","v":35},{"$f":"F$9","v":27},{"$f":"J$8","v":42},{"$f":"J$9","v":34},{"$f":"N$8","v":38},{"$f":"N$9","v":30}]
[null,null,null,null,null,null,null,null,null,null,null,null,null,null,null,null,null,null,null,null,null,null,null,null,null,null,null,null,null,null,{"$f":"F$8","v":35},{"$f":"F$9","v":27},{"$f":"J$8","v":42},{"$f":"J$9","v":34},{"$f":"N$8","v":38},{"$f":"N$9","v":30}]
[null,null,null,null,null,null,null,null,null,null,null,null,null,null,null,null,null,null,null,null,null,null,null,null,null,null,null,null,null,null,{"$f":"F$8","v":35},{"$f":"F$9","v":27},{"$f":"J$8","v":42},{"$f":"J$9","v":34},{"$f":"N$8","v":38},{"$f":"N$9","v":30}]
[null,null,null,null,null,null,null,null,null,null,null,null,null,null,null,null,null,null,null,null,null,null,null,null,null,null,null,null,null,null,{"$f":"F$8","v":35},{"$f":"F$9","v":27},{"$f":"J$8","v":42},{"$f":"J$9","v":34},{"$f":"N$8","v":38},{"$f":"N$9","v":30}]
[null,null,null,null,null,null,null,null,null,null,null,null,null,null,null,null,null,null,null,null,null,null,null,null,null,null,null,null,null,null,{"$f":"F$8","v":35},{"$f":"F$9","v":27},{"$f":"J$8","v":42},{"$f":"J$9","v":34},{"$f":"N$8","v":38},{"$f":"N$9","v":30}]
[null,null,null,null,null,null,null,null,null,null,null,null,null,null,null,null,null,null,null,null,null,null,null,null,null,null,null,null,null,null,{"$f":"F$8","v":35},{"$f":"F$9","v":27},{"$f":"J$8","v":42},{"$f":"J$9","v":34},{"$f":"N$8","v":38},{"$f":"N$9","v":30}]
[null,null,null,null,null,null,null,null,null,null,null,null,null,null,null,null,null,null,null,null,null,null,null,null,null,null,null,null,null,null,{"$f":"F$8","v":35},{"$f":"F$9","v":27},{"$f":"J$8","v":42},{"$f":"J$9","v":34},{"$f":"N$8","v":38},{"$f":"N$9","v":30}]
[null,null,null,null,null,null,null,null,null,null,null,null,null,null,null,null,null,null,null,null,null,null,null,null,null,null,null,null,null,null,{"$f":"F$8","v":35},{"$f":"F$9","v":27},{"$f":"J$8","v":42},{"$f":"J$9","v":34},{"$f":"N$8","v":38},{"$f":"N$9","v":30}]
[null,null,null,null,null,null,null,null,null,null,null,null,null,null,null,null,null,null,null,null,null,null,null,null,null,null,null,null,null,null,{"$f":"F$8","v":35},{"$f":"F$9","v":27},{"$f":"J$8","v":42},{"$f":"J$9","v":34},{"$f":"N$8","v":38},{"$f":"N$9","v":30}]
[null,null,null,null,null,null,null,null,null,null,null,null,null,null,null,null,null,null,null,null,null,null,null,null,null,null,null,null,null,null,{"$f":"F$8","v":35},{"$f":"F$9","v":27},{"$f":"J$8","v":42},{"$f":"J$9","v":34},{"$f":"N$8","v":38},{"$f":"N$9","v":30}]
[null,null,null,null,null,null,null,null,null,null,null,null,null,null,null,null,null,null,null,null,null,null,null,null,null,null,null,null,null,null,{"$f":"F$8","v":35},{"$f":"F$9","v":27},{"$f":"J$8","v":42},{"$f":"J$9","v":34},{"$f":"N$8","v":38},{"$f":"N$9","v":30}]
[null,null,null,null,null,null,null,null,null,null,null,null,null,null,null,null,null,null,null,null,null,null,null,null,null,null,null,null,null,null,35,27,42,34,38,30]
[null,null,null,null,null,null,null,null,null,null,null,null,null,null,null,null,null,null,null,null,null,null,null,null,null,null,null,null,null,null,{"$f":"F$8","v":35},{"$f":"F$9","v":27},{"$f":"J$8","v":42},{"$f":"J$9","v":34},{"$f":"N$8","v":38},{"$f":"N$9","v":30}]
[null,null,null,null,null,null,null,null,null,null,null,null,null,null,null,null,null,null,null,null,null,null,null,null,null,null,null,null,null,null,{"$f":"F$8","v":35},{"$f":"F$9","v":27},{"$f":"J$8","v":42},{"$f":"J$9","v":34},{"$f":"N$8","v":38},{"$f":"N$9","v":30}]
[null,null,null,null,null,null,null,null,null,null,null,null,null,null,null,null,null,null,null,null,null,null,null,null,null,null,null,null,null,null,35,27,42,34,38,30]
[null,null,null,null,null,null,null,null,null,null,null,null,null,null,null,null,null,null,null,null,null,null,null,null,null,null,null,null,null,null,35,27,42,34,38,30]
[null,null,null,null,null,null,null,null,null,null,null,null,null,null,null,null,null,null,null,null,null,null,null,null,null,null,null,null,null,null,35,27,42,34,38,30]
[null,null,null,null,null,null,null,null,null,null,null,null,null,null,null,null,null,null,null,null,null,null,null,null,null,null,null,null,null,null,35,27,42,34,38,30]
[null,null,null,null,null,null,null,null,null,null,null,null,null,null,null,null,null,null,null,null,null,null,null,null,null,null,null,null,null,null,35,27,42,34,38,30]
[null,null,null,null,null,null,null,null,null,null,null,null,null,null,null,null,null,null,null,null,null,null,null,null,null,null,null,null,null,null,35,27,42,34,38,30]
[null,null,null,null,null,null,null,null,null,null,null,null,null,null,null,null,null,null,null,null,null,null,null,null,null,null,null,null,null,null,35,27,42,34,38,30]
[null,null,null,null,null,null,null,null,null,null,null,null,null,null,null,null,null,null,null,null,null,null,null,null,null,null,null,null,null,null,35,27,42,34,38,30]
[null,null,null,null,null,null,null,null,null,null,null,null,null,null,null,null,null,null,null,null,null,null,null,null,null,null,null,null,null,null,35,27,42,34,38,30]
[null,null,null,null,null,null,null,null,null,null,null,null,null,null,null,null,null,null,null,null,null,null,null,null,null,null,null,null,null,null,35,27,42,34,38,30]
[null,null,null,null,null,null,null,null,null,null,null,null,null,null,null,null,null,null,null,null,null,null,null,null,null,null,null,null,null,null,35,27,42,34,38,30]

{"sheet":"Ark1","index":8,"n_rows":0,"n_cols":0,"rows_kept":0,"cut":false,"hidden":false,"merged":[]}

{"sheet":"Ark2","index":9,"n_rows":0,"n_cols":0,"rows_kept":0,"cut":false,"hidden":false,"merged":[]}